{"text_format":"1","workbook":"xlsx","n_sheets":14,"sheets":["E-Land Info","Inhoud","Inleiding","Toelichting","E-Land-CO2","Verklaring","Details","Blad1","Invoer","1 Chips, top, tak","Berekenen","Data","Ketens-Berekend","Lijsten"],"not_rendered":{"charts":0,"images":20,"macros":1,"external_links":0,"defined_names":771,"comments":3,"pivot_tables":0},"unopened":[],"bounds":{"document_bytes":16777216,"sheet_cells":100000,"rows_first":2000,"rows_last":500,"rows_between":2000,"halvings":0,"cell_chars":16384,"cell_head_chars":4096},"cells_cut":0,"cells_raw":0,"read":"whole","date_system":"1900"}

{"sheet":"E-Land Info","index":0,"n_rows":26,"n_cols":5,"rows_kept":26,"cut":false,"hidden":true,"merged":[[4,2,4,4],[24,2,25,3]]}
[]
[]
[null,null,"E-Land",null,"            Energie van het Land"]
[]
[null,null,"De E-land familie is een serie van rekenmodellen waarmee verschillende aspecten van de keten Hout2Warmte mee kunnen worden gesimuleerd. De modellen betreffen nagenoeg alle aspecten van de keten. Zo is er een model (E-Land Hout) om, uitgaande van de houtsoort, de eigenschappen hiervan te bepalen en een model (E-Land Basis) om de fysische en economische relaties tussen hout en fossiele brandstoffen vast te stellen. Deze modellen zijn vrij (om niet) beschikbaar voor belangstellenden. Er zijn ook veel complexere modellen die in meer detail en met adequate analysemethoden de keten kunnen helpen beoordelen. Deze modellen worden door Zilverberg Advies / KandT Management voor adviezen ingezet en zijn niet vrij beschikbaar. De modellen zijn ontwikkeld door en eigendom van KandT Management  en Zilverberg Advies."]
[]
[]
[null,null,"De E-land familie bestaat uit de volgende modules:"]
[]
[null,null,null,"E-Land","Simulatie van de keten Hout2Warmte met veel detail (> 100 invoer parameters) en vele extra's zoals gevoeligheidsanalyse, Pareto, Business model, etc. Het betreft  een Proces-People-Planet-Profit (PPPP) aanpak. Dat betekent dat naast de simulatie van de fysische processen (Proces) ook aspecten van werkgelegenheid (People), klimaat/CO2 (Planet) en kosten en opbrengsten (Profit) worden berekend en geanalyseerd. Het antwoord van de analyse: De prijs en concurentie van houtwarmte ten opzichte van fossiele warmte, nu en in de toekomst."]
[]
[null,null,null,"E-Land Lite","Lichte versie van E-Land. Fit-for-Purpose voor een eerste analyse op basis van hoofdlijnen."]
[]
[null,null,null,"E-land Hout","Fysische eigenschappen van veel voorkomende houtsoorten. "]
[]
[null,null,null,"E-Land Basis","Vergelijking van de een fossiele brandstof met hout en hout met een fossiele brandstof"]
[]
[null,null,null,"E-Land Logistiek","2D simulatie van een regio met betrekking tot transport van biomassa. Ondermeer opbrengst, afstanden, CO2 produtie, kosten. Optimale lokatie voor een houtwerf"]
[]
[null,null,null,"E-Land  Front-End","Gedetaileerde analyse van de voortbrengingsketen van hout tot de eindgebruiker - Centrale vraag: Wat kost het hout ?"]
[]
[]
[]
[]
[null,null,"Voor vragen, info of advies:",null,"Irma Corten via E-mail: irma@zilverbergadvies.nl of mobiel: 06 - 425 879 50"]
[null,null,null,null,"Ger Kupers via E-mail: kupers@kandt.nl of mobiel 06-201 397 88"]

{"sheet":"Inhoud","index":1,"n_rows":21,"n_cols":9,"rows_kept":21,"cut":false,"hidden":true,"merged":[[3,1,3,24]]}
[]
[]
[]
[null,"E-Land-CO2"]
[]
[]
[null,1,null,"Algemene Inleiding"]
[null,2,null,"Handleiding voor het rekenprogramma"]
[null,3,null,"Rekenprogramma E-Land-CO2"]
[null,4,null,"Uitkomsten van de berekeningen"]
[null,5,null,"Gebruikte data voor de berekeningen"]
[null,6,null,"Beoordeelde Nederlandse biomassaketens"]
[null,"6.1",null,null,{"$f":"\"Keten-\"&'Ketens-Berekend'!E8&\"     -\"","v":"Keten-1a     -"},null,null,null,{"$f":"'Ketens-Berekend'!F8","v":"Chips uit top- en tak hout uit bos of landschap"}]
[null,"6.2",null,null,{"$f":"\"Keten-\"&'Ketens-Berekend'!E9&\"     -\"","v":"Keten-2a     -"},null,null,null,{"$f":"'Ketens-Berekend'!F9","v":"Chips uit rondhout uit bos of landschap"}]
[null,null,null,null,{"$f":"\"Keten-\"&'Ketens-Berekend'!E10&\"     -\"","v":"Keten-2b     -"},null,null,null,{"$f":"'Ketens-Berekend'!F10","v":"Pellets uit (vers) rondhout uit bos of landschap"}]
[null,null,null,null,{"$f":"\"Keten-\"&'Ketens-Berekend'!E11&\"     -\"","v":"Keten-2c     -"},null,null,null,{"$f":"'Ketens-Berekend'!F11","v":"Blokken uit rondhout uit bos of landschap"}]
[null,null,null,null,{"$f":"\"Keten-\"&'Ketens-Berekend'!#REF!&\"     -\"","v":{"$error":"#REF!"}},null,null,null,{"$f":"'Ketens-Berekend'!#REF!","v":{"$error":"#REF!"}}]
[null,null,null,null,{"$f":"\"Keten-\"&'Ketens-Berekend'!E12&\"     -\"","v":"Keten-3a     -"},null,null,null,{"$f":"'Ketens-Berekend'!F12","v":"Chips uit reststromen houtindustrie"}]
[null,null,null,null,{"$f":"\"Keten-\"&'Ketens-Berekend'!E13&\"     -\"","v":"Keten-3b     -"},null,null,null,{"$f":"'Ketens-Berekend'!F13","v":"Pellets uit (droge) reststromen houtindustrie"}]
[null,null,null,null,{"$f":"\"Keten-\"&'Ketens-Berekend'!E14&\"     -\"","v":"Keten-4a     -"},null,null,null,{"$f":"'Ketens-Berekend'!F14","v":"Shreds uit groene reststromen"}]
[null,null,null,null,{"$f":"\"Keten-\"&'Ketens-Berekend'!E15&\"     -\"","v":"Keten-4b     -"},null,null,null,{"$f":"'Ketens-Berekend'!F15","v":"Shreds uit zeefoverloop"}]

{"sheet":"Inleiding","index":2,"n_rows":31,"n_cols":56,"rows_kept":31,"cut":false,"hidden":true,"merged":[[1,2,1,55],[27,31,27,34],[27,35,27,38],[23,22,23,29],[24,22,24,25],[24,26,24,29],[26,31,26,38],[5,2,16,28],[5,29,16,55],[30,22,30,29],[26,22,26,29],[27,22,27,29],[27,13,27,16],[27,17,27,20],[26,13,26,20],[29,22,29,29]]}
["Inhoud",null,1,{"$f":"C1+1","v":2},{"$f":"D1+1","v":3},4,5,6,7,8,9,10,11,12,13,14,15,16,17,18,1,{"$f":"U1+1","v":2},{"$f":"V1+1","v":3},4,5,6,7,8,9,10,11,12,13,14,15,16,17,18,1,{"$f":"AM1+1","v":2},{"$f":"AN1+1","v":3},4,5,6,7,8,9,10,11,12,13,14,15,16,17,18]
[null,null,"E-Land-CO2 - Inleiding"]
[]
[]
[]
[null,null,"De vraag naar houtige biobrandstoffen en –grondstoffen groeit, gedreven door de klimaatdoelen en de ontwikkeling naar de ‘biobased economy’. Achtergrond is het streven van de Europese Unie om haar energievoorziening te verduurzamen. Een onderwerp in dit streven is de rol biomassa en haar vermogen om de CO2 uitstoot in vergelijk met fossiele grond- en brandstoffen te verminderen. De EU heft daartoe een omvangrijk regelwerk ingericht om de omgang met biomassaketens te regulieren en om de CO2 uitstoot van biomassaketens te kunnen vaststellen. Op basis van het regelwerk zijn door het Joint research Centre een groot aantal biomassaketens geanalyseerd. In combinatie met de JRC studie is door een consortium van Europese partijen het rekenprogramma BioGrace ontwikkeld. In beide producten is de focus op de CO2 emissie van de verschillende cultivatie, proces en transport stappen. Het programma BioGrace wordt ook de auditors ingezet om biomassaketens te certificeren.",null,null,null,null,null,null,null,null,null,null,null,null,null,null,null,null,null,null,null,null,null,null,null,null,null,null,"Het gebruik van het BioGrace programma wordt door vele biomassaleveranciers als complex ervaren. Daarbij komt dat in Nederland een aantal biomassaketens bestaan die niet in het BioGrace zijn benoemd en die ook niet in het JRC document worden behandeld. Om deze reden heeft de werkgroep CO2 emissiefactoren binnenlandse biomassa van het Agroconvenant Natuur, Bos, Hout en Landschap een project gestart om de voor Nederland interessante en ingezette biomassaketens een en ander inzichtelijk te maken. Daartoe is een inventarisatie van de gebruikelijk biomassaketens in Nederland gemaakt en is een rekenprogramma opgesteld waarmee deze ketens inzichtelijk gemaakt kunnen worden. Tevens is een rekenprogramma ontwikkeld op Proces en/of Transportstappen van een biomassaketen vast te stellen. Met behulp hiervan kunnen eigen processen met betrekking tot CO2 emissies kunnen worden beoordeeld. Doel is om te beoordelen of eigen Processen en/of Transporten beter presteren als de in Europa geldende Processen en Transporten. De toelichting beschrijft de achtergronden en werkwijze va het programma."]
[]
[]
[]
[]
[]
[]
[]
[]
[]
[]
[]
[]
[]
[]
[]
[]
[]
[null,null,null,null,null,null,null,null,null,null,null,null,null,null,null,null,null,null,null,null,null,null,"CO2 emissie uit"]
[]
[]
[null,null,null,null,null,null,null,null,null,null,null,null,null,"Biomassa in",null,null,null,null,null,null,null,null,"Proces of",null,null,null,null,null,null,null,null,"Biomassa uit"]
[null,null,null,null,null,null,null,null,null,null,null,null,null,null,null,null,null,"m3",null,null,null,null,"Transport",null,null,null,null,null,null,null,null,null,null,null,null,"m3"]
[]
[null,null,null,null,null,null,null,null,null,null,null,null,null,null,null,null,null,null,null,null,null,null,"Elektriciteit in"]
[null,null,null,null,null,null,null,null,null,null,null,null,null,null,null,null,null,null,null,null,null,null,"Brandstof in"]

{"sheet":"Toelichting","index":3,"n_rows":262,"n_cols":56,"rows_kept":262,"cut":false,"hidden":false,"merged":[[68,45,68,47],[68,13,68,14],[68,15,68,16],[56,15,56,16],[56,17,56,19],[33,38,35,51],[42,50,42,51],[43,6,43,11],[43,47,43,49],[44,47,44,49],[37,38,37,44],[37,45,37,51],[38,13,38,19],[38,31,38,35],[38,47,38,51],[41,31,41,33],[42,15,42,17],[39,13,39,19],[39,31,39,33],[39,47,39,49],[53,13,53,14],[53,15,53,16],[53,17,53,19],[53,31,53,33],[52,47,52,49],[53,47,53,49],[48,9,48,19],[49,9,49,19],[45,47,45,49],[46,47,46,49],[44,50,44,51],[47,47,47,49],[49,38,49,46],[50,29,50,35],[50,38,50,41],[50,45,50,51],[51,31,51,33],[51,34,51,35],[51,47,51,51],[52,17,52,19],[141,12,141,13],[147,12,147,13],[147,3,147,9],[51,13,51,14],[51,15,51,16],[51,17,51,19],[40,31,40,33],[40,47,40,49],[41,15,41,17],[41,18,41,19],[40,15,40,17],[52,31,52,35],[42,38,42,46],[42,47,42,49],[48,6,48,8],[60,31,60,33],[59,22,59,25],[59,29,59,35],[59,45,59,51],[60,47,60,49],[61,22,61,25],[61,31,61,33],[61,34,61,35],[29,15,29,16],[162,10,162,11],[162,12,162,13],[160,10,160,11],[160,12,160,13],[160,14,160,16],[161,10,161,11],[161,12,161,13],[159,10,159,11],[159,12,159,13],[41,9,41,13],[51,6,51,12],[52,13,52,14],[52,15,52,16],[132,12,132,14],[132,15,132,16],[124,3,126,16],[128,7,128,16],[141,3,141,5],[141,10,141,11],[50,13,50,14],[50,15,50,16],[56,13,56,14],[70,13,70,14],[28,49,28,51],[29,33,29,35],[29,49,29,51],[27,46,27,48],[28,30,28,32],[28,46,28,48],[27,17,27,19],[27,22,28,25],[27,33,27,35],[27,38,28,42],[27,30,27,32],[29,46,29,48],[28,17,28,19],[28,33,28,35],[245,3,245,11],[260,10,260,12],[84,21,88,36],[84,39,88,54],[106,2,115,27],[106,42,106,44],[107,42,107,44],[108,42,108,44],[109,42,109,44],[110,42,110,44],[111,42,111,44],[257,10,257,12],[258,10,258,12],[259,10,259,12],[241,12,241,14],[181,12,181,14],[235,12,235,14],[232,12,232,14],[233,12,233,14],[234,12,234,14],[238,3,238,11],[239,3,239,6],[239,10,239,16],[240,12,240,16],[242,12,242,14],[242,15,242,16],[27,49,27,51],[216,3,217,7],[216,11,216,13],[216,14,216,16],[217,11,217,13],[217,14,217,16],[6,45,7,48],[6,9,7,12],[6,52,7,55],[19,45,20,48],[6,2,7,5],[19,9,20,12],[19,2,20,5],[19,52,20,55],[12,2,13,5],[19,27,20,30],[15,39,16,42],[6,27,7,30],[12,52,13,55],[19,33,20,36],[19,39,20,42],[19,15,20,18],[6,15,7,18],[110,45,110,48],[200,12,200,14],[197,3,197,6],[197,10,197,16],[198,12,198,14],[198,15,198,16],[199,3,199,6],[199,10,199,16],[6,33,7,36],[6,39,7,42],[12,39,13,42],[12,9,13,12],[12,15,13,18],[12,21,13,24],[12,27,13,30],[12,33,13,36],[118,14,118,16],[113,42,113,44],[114,42,114,44],[70,29,70,31],[29,30,29,32],[24,2,24,55],[19,21,20,24],[6,21,7,24],[70,45,70,47],[1,2,1,55],[167,3,168,6],[167,11,167,13],[167,14,167,16],[168,11,168,13],[168,14,168,16],[101,3,102,18],[101,21,102,36],[101,39,102,54],[90,3,98,18],[84,3,87,18],[80,21,81,36],[80,39,81,54],[80,3,81,18],[3,2,3,27],[3,29,3,55],[12,45,13,48],[111,45,111,48],[113,45,113,48],[114,45,114,48],[106,45,106,48],[107,45,107,48],[108,45,108,48],[109,45,109,48],[56,6,56,12],[131,12,131,14],[119,12,119,13],[120,10,120,11],[120,12,120,13],[119,14,119,16],[193,12,193,14],[178,12,178,16],[179,12,179,14],[180,12,180,14],[169,11,169,13],[169,14,169,16],[173,3,175,16],[177,3,177,6],[177,10,177,16],[71,13,71,14],[129,10,129,16],[70,15,70,16],[76,2,76,55],[68,29,68,31],[64,31,64,33],[64,34,64,35],[64,47,64,49],[64,50,64,51],[145,3,145,9],[145,10,145,11],[145,12,145,13],[145,14,145,16],[146,10,146,11],[146,12,146,13],[146,14,146,16],[147,10,147,11],[14,2,14,5],[142,3,142,9],[142,10,142,11],[142,12,142,13],[142,14,142,16],[143,10,143,11],[143,12,143,13],[130,10,130,16],[118,10,118,11],[118,12,118,13],[119,10,119,11],[27,13,27,14],[27,15,27,16],[28,13,28,14],[28,15,28,16],[29,13,29,14],[37,22,37,25],[37,29,37,35],[33,6,35,19],[143,3,143,9],[144,3,144,9],[146,3,146,9],[33,22,35,35],[71,15,71,16],[71,29,71,31],[140,6,140,16],[52,6,52,12],[53,6,53,12],[55,6,55,12],[50,6,50,8],[37,10,37,19],[54,6,54,12],[54,13,54,14],[54,15,54,16],[143,14,143,16],[134,3,134,8],[139,3,139,5],[132,6,132,10],[133,12,133,14],[139,6,139,16],[53,50,53,51],[54,31,54,33],[54,34,54,35],[56,38,56,46],[57,22,57,25],[57,29,57,35],[57,38,57,41],[57,45,57,51],[58,13,58,14],[58,15,58,16],[58,17,58,19],[58,31,58,33],[58,34,58,35],[58,47,58,49],[58,50,58,51],[55,13,55,14],[55,15,55,16],[55,17,55,19],[54,17,54,19],[69,32,69,35],[69,48,69,50],[70,17,70,19],[72,13,72,14],[72,15,72,16],[72,17,72,19],[72,29,72,31],[72,45,72,47],[149,10,149,11],[149,12,149,13],[149,14,149,16],[147,14,147,16],[144,10,144,11],[144,12,144,13],[144,14,144,16],[71,45,71,47],[69,13,69,14],[69,15,69,16],[69,17,69,19],[69,29,69,31],[69,45,69,47],[161,14,161,16],[163,10,163,11],[163,12,163,13],[163,14,163,16],[190,10,190,16],[191,12,191,14],[191,15,191,16],[192,12,192,16],[194,12,194,14],[194,15,194,16],[201,3,201,6],[201,12,201,14],[201,15,201,16],[204,12,204,14],[204,15,204,16],[209,13,209,16],[212,10,212,12],[233,15,233,16],[236,12,236,14],[209,10,209,12],[210,10,210,12],[211,10,211,12],[208,10,208,12],[227,12,227,16],[228,12,228,14],[229,12,229,14],[231,3,231,11],[231,12,231,14],[231,15,231,16],[218,11,218,13],[218,14,218,16],[222,3,224,16],[226,3,226,9],[226,10,226,16],[261,10,261,12],[246,3,246,6],[246,10,246,16],[247,12,247,14],[247,15,247,16],[248,10,248,16],[249,12,249,14],[253,12,253,14],[253,15,253,16],[258,13,258,15]]}
[null,null,1,{"$f":"C1+1","v":2},{"$f":"D1+1","v":3},4,5,6,7,8,9,10,11,12,13,14,15,16,17,18,1,{"$f":"U1+1","v":2},{"$f":"V1+1","v":3},4,5,6,7,8,9,10,11,12,13,14,15,16,17,18,1,{"$f":"AM1+1","v":2},{"$f":"AN1+1","v":3},4,5,6,7,8,9,10,11,12,13,14,15,16,17,18]
[null,null,"E-Land-CO2"]
[]
[null,null,"In onderstaand schema is een biomassaketen weergegeven. De keten bestaat uit een aantal processen (verzamelen, chippen, pelletiseren, etc) en transporten. Voor de leveranciers van biomassa is het van belang te weten hoeveel CO2 er tijdens de verschillende ketenstappen ontstaat, temeer omdat dit in toenemende mate door de afnemers van de biomassa wordt gevraagd of omdat hieraan bepaalde eisen worden gesteld. \nGevraagd wordt in regel naar de CO2 productie per eenheid doorzet. In de Europese aanpak is de eenheid van doorzet vastgesteld op 1 MJ aan het einde van de keten en wel voordat het product (chips, pellets, etc) aan de eindgebruiker wordt geleverd. Dit is een energie-eenheid en is daarom gekozen om alle soorten biobrandstoffen (vast, vloeibaar en gasvormig) met elkaar te kunnen vergelijken. Op basis van de eigenschappen van de specifieke biobrandstoffen zoals de dichtheid en de verbrandingswaarde kunnen andere eigenschappen worden bepaald. Hierin is het rekenprogramma E-Land-CO2 zeer flexibel. \n\n",null,null,null,null,null,null,null,null,null,null,null,null,null,null,null,null,null,null,null,null,null,null,null,null,null,null,"Om een processtap of een transport te kunnen uitvoeren zijn werktuigen nodig die elektriciteit en/of brandstof verbruiken en die  daardoor CO2 uitstoten. Omdat deze apparaten veelal fossiele brandstoffen en/of grijze stroom gebruiken ontstaat er een CO2 uitstoot. Het is het doel van het onderhavige programma is deze CO2 uitstoot te berekenen. In de Europese aanpak wordt niet alleen de CO2 uitstoot bepaald maar tevens de uitstoot van CH4 en N2O. CH4 en N2O zijn veel sterkere broeikasgassen dan CO2. De Global Warming Potentials zijn: CO2 = 1, CH4 = 25 en N2O = 298. Op basis hiervan wordt een equivalente CO2eq berekend. In het programma E-Land-CO2 zijn de bijdragen van CH4 en N2O niet zichtbaar en wordt uitsluitend de CO2eq waarde getoond.\n\nTen gevolge van verliezen in de keten zal om 1MJ aan het einde van de keten te realiseren er aan het begin van de keten meer dan 1 MJ nodig zijn. In de figuur is dit aangegeven met (1+x) MJ. De factor x is de optelsom van alle verliezen tijdens de gang door de biomassaketen. In het rekenprogramma kan worden aangegeven of een bepaalde hoeveelheid biomassa aan het begin (uit het landschap) of aan het einde (aan de eindgebruiker) van de keten dient te worden vastgesteld.\n"]
[]
[]
[null,null,"CO2eq",null,null,null,null,null,null,"CO2eq",null,null,null,null,null,"CO2eq",null,null,null,null,null,"CO2eq",null,null,null,null,null,"CO2eq",null,null,null,null,null,"CO2eq",null,null,null,null,null,"CO2eq",null,null,null,null,null,"CO2eq",null,null,null,null,null,null,"CO2eq"]
[]
[]
[]
[]
[]
[null,null,"(1+x) MJ",null,null,null,null,null,null,"Proces-1",null,null,null,null,null,"Transport-1",null,null,null,null,null,"Proces",null,null,null,null,null,"Transport",null,null,null,null,null,"Proces-3",null,null,null,null,null,"Proces-x",null,null,null,null,null,"Transport-y",null,null,null,null,null,null,"1 MJ"]
[]
[null,null,"Grondstof",null,null,null,null,null,null,null,null,null,null,null,null,null,null,null,null,null,null,null,null,null,null,null,null,null,null,null,null,null,null,null,null,null,null,null,null,null,null,null,null,null,null,null,null,null,null,null,null,null,"Eindproduct"]
[null,null,null,null,null,null,null,null,null,null,null,null,null,null,null,null,null,null,null,null,null,null,null,null,null,null,null,null,null,null,null,null,null,null,null,null,null,null,null,"Proces-x"]
[null,null,null,null,null,null,null,null,null,null,null,null,null,null,null,null,null,null,null,null,null,null,null,null,"Dit programma"]
[]
[]
[null,null,"Elektriciteit\nBrandstof",null,null,null,null,null,null,"Elektriciteit\nBrandstof",null,null,null,null,null,"Elektriciteit\nBrandstof",null,null,null,null,null,"Elektriciteit\nBrandstof",null,null,null,null,null,"Elektriciteit\nBrandstof",null,null,null,null,null,"Elektriciteit\nBrandstof",null,null,null,null,null,"Elektriciteit\nBrandstof",null,null,null,null,null,"Elektriciteit\nBrandstof",null,null,null,null,null,null,"Elektriciteit\nBrandstof"]
[]
[]
[]
[]
[null,null,"In het rekenprogramma kunnen, na invulling van algemene gegevens over de biomassa,  één Proces- en één Transportstap gemodeleerd worden."]
[]
[null,null,null,null,null,null,null,null,null,null,null,null,null,null,"NL",null,"EU"]
[null,null,null,null,null,null,null,null,null,null,null,null,"CO2eq",{"$f":"IF(Samenvatting_NL_Keten_CO2<10,TEXT(Samenvatting_NL_Keten_CO2,\"#.##0,0\"),TEXT(Samenvatting_NL_Keten_CO2,\"#.##\"))","v":"82.037"},null,{"$f":"IF(VLOOKUP(Hout_Keten_EU,Lijst_EU_Keten,Keten_Titel_NL_EU)=\"NL\",\"\",\nIF(Samenvatting_EU_Keten_CO2<10,TEXT(Samenvatting_EU_Keten_CO2,\"#.##0,0\"),TEXT(Samenvatting_EU_Keten_CO2,\"#.##\")))","v":"165.106"},null,"kgCO2eq",null,null,null,null,"Proces",null,null,null,null,null,null,"CO2eq",{"$f":"IF(Samenvatting_Proces_CO2T<10,TEXT(Samenvatting_Proces_CO2T,\"#.##0,0\"),TEXT(Samenvatting_Proces_CO2T,\"#.##\"))","v":"47.924.767"},null,null,"gCO2eq",null,null,null,null,"Transport",null,null,null,null,null,null,"CO2eq",{"$f":"IF(Samenvatting_Transport_CO2T<10,TEXT(Samenvatting_Transport_CO2T,\"#.##0,0\"),TEXT(Samenvatting_Transport_CO2T,\"#.##\"))","v":"10.360.419"},null,null,"gCO2eq"]
[null,null,null,null,null,null,null,null,null,null,null,null,"Doorzet",{"$f":"IF(Samenvatting_Hout_Doorzet<10,TEXT(Samenvatting_Hout_Doorzet,\"#.##0,0\"),TEXT(Samenvatting_Hout_Doorzet,\"#.##\"))","v":"1.803"},null,{"$f":"IF(VLOOKUP(Hout_Keten_EU,Lijst_EU_Keten,Keten_Titel_NL_EU)=\"NL\",\"\",\nIF(Samenvatting_Hout_Doorzet<10,TEXT(Samenvatting_Hout_Doorzet,\"#.##0,0\"),TEXT(Samenvatting_Hout_Doorzet,\"#.##\")))","v":"1.803"},null,"tonds",null,null,null,null,null,null,null,null,null,null,null,"Doorzet",{"$f":"IF(Samenvatting_Proces_Doorzet<10,TEXT(Samenvatting_Proces_Doorzet,\"#.##0,0\"),TEXT(Samenvatting_Proces_Doorzet,\"#.##\"))","v":"34.107.141"},null,null,"MJ",null,null,null,null,null,null,null,null,null,null,null,"Doorzet",{"$f":"IF(Samenvatting_Transport_Doorzet<10,TEXT(Samenvatting_Transport_Doorzet,\"#.##0,0\"),TEXT(Samenvatting_Transport_Doorzet,\"#.##\"))","v":"34.107.141"},null,null,"MJ"]
[null,null,null,null,null,null,null,null,null,null,null,null,"CO2eq/Doorzet",{"$f":"IF(N28/N29<10,TEXT(N28/N29,\"#.##0,0\"),TEXT(N28/N29,\"#.##\"))","v":"46"},null,{"$f":"IF(VLOOKUP(Hout_Keten_EU,Lijst_EU_Keten,Keten_Titel_NL_EU)=\"NL\",\"\",\nIF(P28/P29<10,TEXT(P28/P29,\"#.##0,0\"),TEXT(P28/P29,\"#.##\")))","v":"92"},null,{"$f":"Samenvatting_Hout_CO2T_Dim&\"/\"&Samenvatting_Hout_Doorzet_Dim","v":"kgCO2eq/tonds"},null,null,null,null,null,null,null,null,null,null,null,"CO2eq/Doorzet",{"$f":"IF(AE28/AE29<10,TEXT(AE28/AE29,\"#.##0,0\"),TEXT(AE28/AE29,\"#.##\"))","v":"1,4"},null,null,{"$f":"Samenvatting_Proces_CO2T_Dim&\"/\"&Samenvatting_Proces_Doorzet_Dim","v":"gCO2eq/MJ"},null,null,null,null,null,null,null,null,null,null,null,"CO2eq/Doorzet",{"$f":"IF(AU28/AU29<10,TEXT(AU28/AU29,\"#.##0,0\"),TEXT(AU28/AU29,\"#.##\"))","v":"0,3"},null,null,{"$f":"Samenvatting_Transport_CO2T_Dim&\"/\"&Samenvatting_Transport_Doorzet_Dim","v":"gCO2eq/MJ"}]
[null,null,null,null,null,"©KandT/Zilverberg"]
[]
[null,null,null,null,null,null,"Opmerkingen:",null,null,null,null,null,null,null,null,null,null,null,null,null,null,null,"Opmerkingen:",null,null,null,null,null,null,null,null,null,null,null,null,null,null,null,"Opmerkingen:"]
[null,null,null,null,null,null,null,null,null,null,null,null,null,null,null,null,null,null,null,null,null,null,"Er wordt per keer zoveel gechipt als in de bunker past: 80/85 m3. Kosten 3 uur chipper 250 €/uur (veel kosten voor heen en weer rijden, vanwege kleine hoeveelheid).",null,null,null,null,null,null,null,null,null,null,null,null,null,null,null,"Vrachtwagens komen leeg terug"]
[]
[]
[]
[null,null,null,null,null,null,"Omschrijving",null,null,null,"Levering Biomassacentrale Texel",null,null,null,null,null,null,null,null,null,null,null,"Omschrijving",null,null,null,null,null,null,"Chippen",null,null,null,null,null,null,null,null,"Omschrijving",null,null,null,null,null,null,"Transport naar afnemer"]
[null,null,null,null,null,null,"Houtsoort",null,null,null,null,null,null,"Loofhout mix NL",null,null,null,null,null,null,null,null,"Houtvorm proces",null,null,null,null,null,null,null,null,"Chips G50/P31,5",null,null,null,null,null,null,"Houtvorm",null,null,null,null,null,null,null,null,{"$f":"Proces_Vorm","v":"Chips G50/P31,5"}]
[null,null,null,null,null,null,"Houtvorm oogst",null,null,null,null,null,null,"Top- en takhout",null,null,null,null,null,null,null,null,"Verandering Houthoeveelheid",null,null,null,null,null,null,null,null,-2,null,null,"%",null,null,null,"Verandering Houthoeveelheid",null,null,null,null,null,null,null,null,0,null,null,"%"]
[null,null,null,null,null,null,"Vochtigheid / vochtgehalte oogst",null,null,null,null,null,null,null,null,50,null,null,{"$f":"Uit_Hout_Vochtgehalte","v":100},"%",null,null,"Verandering Houtvochtigheid ",null,null,null,null,null,null,null,null,0,null,null,"%",null,null,null,"Verandering Houtvochtigheid ",null,null,null,null,null,null,null,null,0,null,null,"%"]
[null,null,null,null,null,null,"Hoeveelheid",null,null,"naar eindgebruiker",null,null,null,null,null,10000,null,null,"m3"]
[null,null,null,null,null,null,null,null,null,null,null,null,null,null,null,null,null,null,null,null,null,null,null,null,null,null,null,null,null,null,null,null,null,null,null,null,null,null,"Afstand - enkele reis",null,null,null,null,null,null,null,null,50,null,null,"km"]
[null,null,null,null,null,null,"CO2 Emissiefactoren volgens",null,null,null,null,null,null,"BioGrace - II",null,null,null,null,null,null,null,null,null,null,null,null,null,null,null,null,null,null,null,null,null,null,null,null,"Laadruimte",null,null,null,null,null,null,null,null,90,null,null,"m3"]
[null,null,null,null,null,null,null,null,null,null,null,null,null,"CO2 emissiefactoren - 2018",null,null,null,null,null,null,null,null,null,null,null,null,null,null,null,null,null,null,null,null,null,null,null,null,"Laadvermogen",null,null,null,null,null,null,null,null,25,null,null,"ton"]
[null,null,null,null,null,null,null,null,null,null,null,null,null,"Beide",null,null,null,null,null,null,null,null,null,null,null,null,null,null,null,null,null,null,null,null,null,null,null,null,"Belading heen",null,null,null,null,null,null,null,null,100,null,null,"%"]
[null,null,null,null,null,null,null,null,null,null,null,null,null,null,null,null,null,null,null,null,null,null,null,null,null,null,null,null,null,null,null,null,null,null,null,null,null,null,"Belading terug",null,null,null,null,null,null,null,null,50,null,null,"%"]
[null,null,null,null,null,null,null,null,null,null,null,null,null,null,null,null,null,null,null,null,null,null,null,null,null,null,null,null,null,null,null,null,null,null,null,null,null,null,"Snelheid",null,null,null,null,null,null,null,null,55,null,null,"km/uur"]
[null,null,null,null,null,null,"Keten",null,null,"1a-Chips uit top- en tak hout uit bos of landschap"]
[null,null,null,null,null,null,"Pathway",null,null,{"$f":"LOOKUP(Hout_Keten_NL,Lijst_NL_Keten_Nr_Titel,Lijst_EU_Keten_Nr_Titel)","v":"1a-Woodchips from forest residues"},null,null,null,null,null,null,null,null,null,null,null,null,"Gebruik Brandstof",null,null,null,null,null,null,null,null,null,null,null,null,null,null,null,"Gebruik Brandstof"]
[null,null,null,null,null,null,"Ketenstappen",null,null,null,null,null,null,"NL",null,"EU",null,null,null,null,null,null,"Werktuig",null,null,null,null,null,null,"Chipper",null,null,null,null,null,null,null,null,"Werktuig",null,null,null,null,null,null,"Vrachtauto DAF 250"]
[null,null,null,null,null,{"$f":"IF(VLOOKUP(Hout_Keten_NL,Lijst_NL_Keten,11)=\"\",\"\",1)","v":1},{"$f":"IF(VLOOKUP(Hout_Keten_NL,Lijst_NL_Keten,11)=\"\",\"\",VLOOKUP(Hout_Keten_NL,Lijst_NL_Keten,11))","v":"Inzamelen top- en takhout"},null,null,null,null,null,null,{"$f":"IF(VLOOKUP(Hout_Keten_NL,Lijst_NL_Keten,Keten_Stap1+0*Keten_Delta)=\"\",\"\",\nIF(Uit_NL_Keten_Totaal_CO2<1,IF(Uit_NL_Keten_Stap1_CO2<0.005,\"0,00\",TEXT(Uit_NL_Keten_Stap1_CO2,\"#.##0,00\")),\nIF(Uit_NL_Keten_Totaal_CO2<10,IF(Uit_NL_Keten_Stap1_CO2<0.05,\"0,0\",TEXT(Uit_NL_Keten_Stap1_CO2,\"#.##0,0\")),\nIF(Uit_NL_Keten_Totaal_CO2<50,IF(Uit_NL_Keten_Stap1_CO2<0.5,\"0\",TEXT(Uit_NL_Keten_Stap1_CO2,\"#.##\")),\nIF(Uit_NL_Keten_Stap1_CO2<0.5,\"0\",TEXT(Uit_NL_Keten_Stap1_CO2,\"#.##\"))))))","v":"0,8"},null,{"$f":"IF(VLOOKUP(Hout_Keten_NL,Lijst_NL_Keten,Keten_Stap1+0*Keten_Delta)=\"\",\"\",\nIF(Uit_NL_Keten_Totaal_CO2<1,IF(Uit_EU_Keten_Stap1_CO2<0.005,\"0,00\",TEXT(Uit_EU_Keten_Stap1_CO2,\"#.##0,00\")),\nIF(Uit_NL_Keten_Totaal_CO2<10,IF(Uit_EU_Keten_Stap1_CO2<0.05,\"0,0\",TEXT(Uit_EU_Keten_Stap1_CO2,\"#.##0,0\")),\nIF(Uit_NL_Keten_Totaal_CO2<50,IF(Uit_EU_Keten_Stap1_CO2<0.5,\"0\",TEXT(Uit_EU_Keten_Stap1_CO2,\"#.##\")),\nIF(Uit_EU_Keten_Stap1_CO2<0.5,\"0\",TEXT(Uit_EU_Keten_Stap1_CO2,\"#.##\"))))))","v":"1,5"},null,{"$f":"IF(VLOOKUP(Hout_Keten_NL,Lijst_NL_Keten,Keten_Stap1+0*Keten_Delta)=\"\",\"\",Uit_NL_EU_Keten_CO2_Dim)","v":"gCO2eq/MJ"},null,null,{"$f":"IF(VLOOKUP(Hout_Keten_NL,Lijst_NL_Keten,Keten_Stap1_CPT+0*Keten_Delta)=\"\",\"\",VLOOKUP(Hout_Keten_NL,Lijst_NL_Keten,Keten_Stap1_CPT+0*Keten_Delta))","v":"P"},null,"Capaciteit werktuig",null,null,null,null,null,null,null,{"$f":"IF(OR(AND(Proces_Verbrandingsmotor_Inzet=\"\",Proces_Verbrandingsmotor_Ja_Nee=\"Ja\"),\nAND(Proces_Verbrandingsmotor_Inzet_Dim=\"\",Proces_Verbrandingsmotor_Ja_Nee=\"Ja\")),\"▼\",\"\")","v":""},50,null,null,"m3/uur",null,null,null,"Brandstof",null,null,null,null,null,null,null,{"$f":"IF(AND(Transport_Verbrandingsmotor_Brandstof=\"\",Transport_Verbrandingsmotor_ID=1),\"▼\",\"\")","v":""},"EU-Diesel"]
[null,null,null,null,null,{"$f":"IF(VLOOKUP(Hout_Keten_NL,Lijst_NL_Keten,22)=\"\",\"\",2)","v":2},{"$f":"IF(VLOOKUP(Hout_Keten_NL,Lijst_NL_Keten,22)=\"\",\"\",VLOOKUP(Hout_Keten_NL,Lijst_NL_Keten,22))","v":"Drogen langs de weg"},null,null,null,null,null,null,{"$f":"IF(VLOOKUP(Hout_Keten_NL,Lijst_NL_Keten,Keten_Stap1+1*Keten_Delta)=\"\",\"\",\nIF(Uit_NL_Keten_Totaal_CO2<1,IF(Uit_NL_Keten_Stap2_CO2<0.005,\"0,00\",TEXT(Uit_NL_Keten_Stap2_CO2,\"#.##0,00\")),\nIF(Uit_NL_Keten_Totaal_CO2<10,IF(Uit_NL_Keten_Stap2_CO2<0.05,\"0,0\",TEXT(Uit_NL_Keten_Stap2_CO2,\"#.##0,0\")),\nIF(Uit_NL_Keten_Totaal_CO2<50,IF(Uit_NL_Keten_Stap2_CO2<0.5,\"0\",TEXT(Uit_NL_Keten_Stap2_CO2,\"#.##\")),\nIF(Uit_NL_Keten_Stap2_CO2<0.5,\"0\",TEXT(Uit_NL_Keten_Stap2_CO2,\"#.##\"))))))","v":"0,0"},null,{"$f":"IF(VLOOKUP(Hout_Keten_NL,Lijst_NL_Keten,Keten_Stap1+1*Keten_Delta)=\"\",\"\",\nIF(Uit_NL_Keten_Totaal_CO2<1,IF(Uit_EU_Keten_Stap2_CO2<0.005,\"0,00\",TEXT(Uit_EU_Keten_Stap2_CO2,\"#.##0,00\")),\nIF(Uit_NL_Keten_Totaal_CO2<10,IF(Uit_EU_Keten_Stap2_CO2<0.05,\"0,0\",TEXT(Uit_EU_Keten_Stap2_CO2,\"#.##0,0\")),\nIF(Uit_NL_Keten_Totaal_CO2<50,IF(Uit_EU_Keten_Stap2_CO2<0.5,\"0\",TEXT(Uit_EU_Keten_Stap2_CO2,\"#.##\")),\nIF(Uit_EU_Keten_Stap2_CO2<0.5,\"0\",TEXT(Uit_EU_Keten_Stap2_CO2,\"#.##\"))))))","v":"0,0"},null,{"$f":"IF(VLOOKUP(Hout_Keten_NL,Lijst_NL_Keten,Keten_Stap1+1*Keten_Delta)=\"\",\"\",Uit_NL_EU_Keten_CO2_Dim)","v":"gCO2eq/MJ"},null,null,{"$f":"IF(VLOOKUP(Hout_Keten_NL,Lijst_NL_Keten,Keten_Stap1_CPT+1*Keten_Delta)=\"\",\"\",VLOOKUP(Hout_Keten_NL,Lijst_NL_Keten,Keten_Stap1_CPT+1*Keten_Delta))","v":"P"},null,"Brandstof",null,null,null,null,null,null,null,{"$f":"IF(AND(Proces_Verbrandingsmotor_Brandstof=\"\",Proces_Verbrandingsmotor_Ja_Nee=\"Ja\"),\"▼\",\"\")","v":""},"EU-Diesel",null,null,null,null,null,null,"Euronorm/Categorie",null,null,null,null,null,null,null,null,"Euro 6"]
[null,null,null,null,null,{"$f":"IF(VLOOKUP(Hout_Keten_NL,Lijst_NL_Keten,33)=\"\",\"\",3)","v":3},{"$f":"IF(VLOOKUP(Hout_Keten_NL,Lijst_NL_Keten,33)=\"\",\"\",VLOOKUP(Hout_Keten_NL,Lijst_NL_Keten,33))","v":"Chippen"},null,null,null,null,null,null,{"$f":"IF(VLOOKUP(Hout_Keten_NL,Lijst_NL_Keten,Keten_Stap1+2*Keten_Delta)=\"\",\"\",\nIF(Uit_NL_Keten_Totaal_CO2<1,IF(Uit_NL_Keten_Stap3_CO2<0.005,\"0,00\",TEXT(Uit_NL_Keten_Stap3_CO2,\"#.##0,00\")),\nIF(Uit_NL_Keten_Totaal_CO2<10,IF(Uit_NL_Keten_Stap3_CO2<0.05,\"0,0\",TEXT(Uit_NL_Keten_Stap3_CO2,\"#.##0,0\")),\nIF(Uit_NL_Keten_Totaal_CO2<50,IF(Uit_NL_Keten_Stap3_CO2<0.5,\"0\",TEXT(Uit_NL_Keten_Stap3_CO2,\"#.##\")),\nIF(Uit_NL_Keten_Stap3_CO2<0.5,\"0\",TEXT(Uit_NL_Keten_Stap3_CO2,\"#.##\"))))))","v":"0,7"},null,{"$f":"IF(VLOOKUP(Hout_Keten_NL,Lijst_NL_Keten,Keten_Stap1+2*Keten_Delta)=\"\",\"\",\nIF(Uit_NL_Keten_Totaal_CO2<1,IF(Uit_EU_Keten_Stap3_CO2<0.005,\"0,00\",TEXT(Uit_EU_Keten_Stap3_CO2,\"#.##0,00\")),\nIF(Uit_NL_Keten_Totaal_CO2<10,IF(Uit_EU_Keten_Stap3_CO2<0.05,\"0,0\",TEXT(Uit_EU_Keten_Stap3_CO2,\"#.##0,0\")),\nIF(Uit_NL_Keten_Totaal_CO2<50,IF(Uit_EU_Keten_Stap3_CO2<0.5,\"0\",TEXT(Uit_EU_Keten_Stap3_CO2,\"#.##\")),\nIF(Uit_EU_Keten_Stap3_CO2<0.5,\"0\",TEXT(Uit_EU_Keten_Stap3_CO2,\"#.##\"))))))","v":"0,4"},null,{"$f":"IF(VLOOKUP(Hout_Keten_NL,Lijst_NL_Keten,Keten_Stap1+2*Keten_Delta)=\"\",\"\",Uit_NL_EU_Keten_CO2_Dim)","v":"gCO2eq/MJ"},null,null,{"$f":"IF(VLOOKUP(Hout_Keten_NL,Lijst_NL_Keten,Keten_Stap1_CPT+2*Keten_Delta)=\"\",\"\",VLOOKUP(Hout_Keten_NL,Lijst_NL_Keten,Keten_Stap1_CPT+2*Keten_Delta))","v":"P"},null,"Euronorm/Categorie",null,null,null,null,null,null,null,null,"Euro 5",null,null,null,null,null,null,"Brandstofverbruik",null,null,null,null,null,null,null,{"$f":"IF(OR(AND(Transport_Verbrandingsmotor_Verbruik=\"\",Transport_Verbrandingsmotor_ID=1),\nAND(Transport_Verbrandingsmotor_Verbruik_Dim=\"\",Transport_Verbrandingsmotor_ID=1)),\"▼\",\"\")","v":""},30,null,null,"liter/100km"]
[null,null,null,null,null,{"$f":"IF(VLOOKUP(Hout_Keten_NL,Lijst_NL_Keten,44)=\"\",\"\",4)","v":4},{"$f":"IF(VLOOKUP(Hout_Keten_NL,Lijst_NL_Keten,44)=\"\",\"\",VLOOKUP(Hout_Keten_NL,Lijst_NL_Keten,44))","v":"Transport chips naar afnemer"},null,null,null,null,null,null,{"$f":"IF(VLOOKUP(Hout_Keten_NL,Lijst_NL_Keten,Keten_Stap1+3*Keten_Delta)=\"\",\"\",\nIF(Uit_NL_Keten_Totaal_CO2<1,IF(Uit_NL_Keten_Stap4_CO2<0.005,\"0,00\",TEXT(Uit_NL_Keten_Stap4_CO2,\"#.##0,00\")),\nIF(Uit_NL_Keten_Totaal_CO2<10,IF(Uit_NL_Keten_Stap4_CO2<0.05,\"0,0\",TEXT(Uit_NL_Keten_Stap4_CO2,\"#.##0,0\")),\nIF(Uit_NL_Keten_Totaal_CO2<50,IF(Uit_NL_Keten_Stap4_CO2<0.5,\"0\",TEXT(Uit_NL_Keten_Stap4_CO2,\"#.##\")),\nIF(Uit_NL_Keten_Stap4_CO2<0.5,\"0\",TEXT(Uit_NL_Keten_Stap4_CO2,\"#.##\"))))))","v":"0,9"},null,{"$f":"IF(VLOOKUP(Hout_Keten_NL,Lijst_NL_Keten,Keten_Stap1+3*Keten_Delta)=\"\",\"\",\nIF(Uit_NL_Keten_Totaal_CO2<1,IF(Uit_EU_Keten_Stap4_CO2<0.005,\"0,00\",TEXT(Uit_EU_Keten_Stap4_CO2,\"#.##0,00\")),\nIF(Uit_NL_Keten_Totaal_CO2<10,IF(Uit_EU_Keten_Stap4_CO2<0.05,\"0,0\",TEXT(Uit_EU_Keten_Stap4_CO2,\"#.##0,0\")),\nIF(Uit_NL_Keten_Totaal_CO2<50,IF(Uit_EU_Keten_Stap4_CO2<0.5,\"0\",TEXT(Uit_EU_Keten_Stap4_CO2,\"#.##\")),\nIF(Uit_EU_Keten_Stap4_CO2<0.5,\"0\",TEXT(Uit_EU_Keten_Stap4_CO2,\"#.##\"))))))","v":"3,0"},null,{"$f":"IF(VLOOKUP(Hout_Keten_NL,Lijst_NL_Keten,Keten_Stap1+3*Keten_Delta)=\"\",\"\",Uit_NL_EU_Keten_CO2_Dim)","v":"gCO2eq/MJ"},null,null,{"$f":"IF(VLOOKUP(Hout_Keten_NL,Lijst_NL_Keten,Keten_Stap1_CPT+3*Keten_Delta)=\"\",\"\",VLOOKUP(Hout_Keten_NL,Lijst_NL_Keten,Keten_Stap1_CPT+3*Keten_Delta))","v":"T"},null,"Brandstofverbruik",null,null,null,null,null,null,null,{"$f":"IF(OR(AND(Proces_Verbrandingsmotor_Verbruik=\"\",Proces_Verbrandingsmotor_Ja_Nee=\"Ja\"),\nAND(Proces_Verbrandingsmotor_Verbruik_Dim=\"\",Proces_Verbrandingsmotor_Ja_Nee=\"Ja\")),\"▼\",\"\")","v":""},50,null,null,"liter/uur"]
[null,null,null,null,null,{"$f":"IF(VLOOKUP(Hout_Keten_NL,Lijst_NL_Keten,55)=\"\",\"\",5)","v":""},{"$f":"IF(VLOOKUP(Hout_Keten_NL,Lijst_NL_Keten,55)=\"\",\"\",VLOOKUP(Hout_Keten_NL,Lijst_NL_Keten,55))","v":""},null,null,null,null,null,null,{"$f":"IF(VLOOKUP(Hout_Keten_NL,Lijst_NL_Keten,Keten_Stap1+4*Keten_Delta)=\"\",\"\",\nIF(Uit_NL_Keten_Totaal_CO2<1,IF(Uit_NL_Keten_Stap5_CO2<0.005,\"0,00\",TEXT(Uit_NL_Keten_Stap5_CO2,\"#.##0,00\")),\nIF(Uit_NL_Keten_Totaal_CO2<10,IF(Uit_NL_Keten_Stap5_CO2<0.05,\"0,0\",TEXT(Uit_NL_Keten_Stap5_CO2,\"#.##0,0\")),\nIF(Uit_NL_Keten_Totaal_CO2<50,IF(Uit_NL_Keten_Stap5_CO2<0.5,\"0\",TEXT(Uit_NL_Keten_Stap5_CO2,\"#.##\")),\nIF(Uit_NL_Keten_Stap5_CO2<0.5,\"0\",TEXT(Uit_NL_Keten_Stap5_CO2,\"#.##\"))))))","v":""},null,{"$f":"IF(VLOOKUP(Hout_Keten_NL,Lijst_NL_Keten,Keten_Stap1+4*Keten_Delta)=\"\",\"\",\nIF(Uit_NL_Keten_Totaal_CO2<1,IF(Uit_EU_Keten_Stap5_CO2<0.005,\"0,00\",TEXT(Uit_EU_Keten_Stap5_CO2,\"#.##0,00\")),\nIF(Uit_NL_Keten_Totaal_CO2<10,IF(Uit_EU_Keten_Stap5_CO2<0.05,\"0,0\",TEXT(Uit_EU_Keten_Stap5_CO2,\"#.##0,0\")),\nIF(Uit_NL_Keten_Totaal_CO2<50,IF(Uit_EU_Keten_Stap5_CO2<0.5,\"0\",TEXT(Uit_EU_Keten_Stap5_CO2,\"#.##\")),\nIF(Uit_EU_Keten_Stap5_CO2<0.5,\"0\",TEXT(Uit_EU_Keten_Stap5_CO2,\"#.##\"))))))","v":""},null,{"$f":"IF(VLOOKUP(Hout_Keten_NL,Lijst_NL_Keten,Keten_Stap1+4*Keten_Delta)=\"\",\"\",Uit_NL_EU_Keten_CO2_Dim)","v":""},null,null,{"$f":"IF(VLOOKUP(Hout_Keten_NL,Lijst_NL_Keten,Keten_Stap1_CPT+4*Keten_Delta)=\"\",\"\",VLOOKUP(Hout_Keten_NL,Lijst_NL_Keten,Keten_Stap1_CPT+4*Keten_Delta))","v":""}]
[null,null,null,null,null,{"$f":"IF(VLOOKUP(Hout_Keten_NL,Lijst_NL_Keten,77)=\"\",\"\",6)","v":""},{"$f":"IF(VLOOKUP(Hout_Keten_NL,Lijst_NL_Keten,63)=\"\",\"\",VLOOKUP(Hout_Keten_NL,Lijst_NL_Keten,63))","v":""},null,null,null,null,null,null,{"$f":"IF(VLOOKUP(Hout_Keten_NL,Lijst_NL_Keten,Keten_Stap1+5*Keten_Delta)=\"\",\"\",\nIF(Uit_NL_Keten_Totaal_CO2<1,IF(Uit_NL_Keten_Stap6_CO2<0.005,\"0,00\",TEXT(Uit_NL_Keten_Stap6_CO2,\"#.##0,00\")),\nIF(Uit_NL_Keten_Totaal_CO2<10,IF(Uit_NL_Keten_Stap6_CO2<0.05,\"0,0\",TEXT(Uit_NL_Keten_Stap6_CO2,\"#.##0,0\")),\nIF(Uit_NL_Keten_Totaal_CO2<50,IF(Uit_NL_Keten_Stap6_CO2<0.5,\"0\",TEXT(Uit_NL_Keten_Stap6_CO2,\"#.##\")),\nIF(Uit_NL_Keten_Stap6_CO2<0.5,\"0\",TEXT(Uit_NL_Keten_Stap6_CO2,\"#.##\"))))))","v":""},null,{"$f":"IF(VLOOKUP(Hout_Keten_NL,Lijst_NL_Keten,Keten_Stap1+5*Keten_Delta)=\"\",\"\",\nIF(Uit_NL_Keten_Totaal_CO2<1,IF(Uit_EU_Keten_Stap6_CO2<0.005,\"0,00\",TEXT(Uit_EU_Keten_Stap6_CO2,\"#.##0,00\")),\nIF(Uit_NL_Keten_Totaal_CO2<10,IF(Uit_EU_Keten_Stap6_CO2<0.05,\"0,0\",TEXT(Uit_EU_Keten_Stap6_CO2,\"#.##0,0\")),\nIF(Uit_NL_Keten_Totaal_CO2<50,IF(Uit_EU_Keten_Stap6_CO2<0.5,\"0\",TEXT(Uit_EU_Keten_Stap6_CO2,\"#.##\")),\nIF(Uit_EU_Keten_Stap6_CO2<0.5,\"0\",TEXT(Uit_EU_Keten_Stap6_CO2,\"#.##\"))))))","v":""},null,{"$f":"IF(VLOOKUP(Hout_Keten_NL,Lijst_NL_Keten,Keten_Stap1+5*Keten_Delta)=\"\",\"\",Uit_NL_EU_Keten_CO2_Dim)","v":""},null,null,{"$f":"IF(VLOOKUP(Hout_Keten_NL,Lijst_NL_Keten,Keten_Stap1_CPT+5*Keten_Delta)=\"\",\"\",VLOOKUP(Hout_Keten_NL,Lijst_NL_Keten,Keten_Stap1_CPT+5*Keten_Delta))","v":""},null,"Gebruik Elektriciteit",null,null,null,null,null,null,null,null,null,null,null,null,null,null,null,"Gebruik Elektriciteit"]
[null,null,null,null,null,null,null,null,null,null,null,null,null,null,null,null,null,null,null,null,null,null,"Werktuig",null,null,null,null,null,null,"Hulpaandrijving",null,null,null,null,null,null,null,null,"n.v.t."]
[null,null,null,null,null,null,null,null,null,null,null,null,null,null,null,null,null,null,null,null,null,null,null,"Verbruik",null,null,null,null,null,null,{"$f":"IF(OR(AND(Proces_Elektromotor_VermogenVerbruik=\"\",Proces_Elektromotor_Ja_Nee=\"Ja\"),\nAND(Proces_Elektromotor_VermogenVerbruik_Dim=\"\",Proces_Elektromotor_Ja_Nee=\"Ja\")),\"▼\",\"\")","v":""},2500,null,null,"kWh",null,null,null,null,"n.v.t.",null,null,null,null,null,null,{"$f":"IF(OR(AND(Transport_Elektromotor_VermogenVerbruik=\"\",Transport_Elektromotor_Ja_Nee=\"Ja\"),\nAND(Transport_Elektromotor_VermogenVerbruik_Dim=\"\",Transport_Elektromotor_Ja_Nee=\"Ja\")),\"▼\",\"\")","v":""}]
[null,null,null,null,null,null,null,null,null,null,null,null,null,null,null,null,null,null,null,null,null,null,"Stroombron",null,null,null,null,null,{"$f":"IF(AND(Proces_Elektromotor_Stroombron=\"\",Proces_Elektromotor_Ja_Nee=\"Ja\"),\"▼\",\"\")","v":""},"EU-Elektriciteit NL",null,null,null,null,null,null,null,null,"n.v.t.",null,null,null,null,null,{"$f":"IF(AND(Transport_Elektromotor_Stroombron=\"\",Transport_Elektromotor_Ja_Nee=\"Ja\"),\"▼\",\"\")","v":""}]
[null,null,null,null,null,null,null,null,null,null,null,null,null,null,null,null,null,null,null,null,null,null,"n.v.T.",null,null,null,null,null,null,null,{"$f":"IF(AND(Proces_Elektromotor_Loadfactor=\"\",Proces_Elektromotor_Ja_Nee=\"Ja\",Proces_Elektromotor_Vermogen_Verbruik=\"Vermogen\"),\"▼\",\"\")","v":""},null,null,null,null,null,null,null,"Loadfactor",null,null,null,null,null,null,null,{"$f":"IF(AND(Transport_Elektromotor_Loadfactor=\"\",Transport_Elektromotor_Ja_Nee=\"Ja\",Transport_Elektromotor_Vermogen_Verbruik=\"Vermogen\"),\"▼\",\"\")","v":""},null,null,null,"%"]
[null,null,null,null,null,null,null,null,null,null,null,null,null,null,null,null,null,null,null,null,null,null,"n.v.t.",null,null,null,null,null,null,null,{"$f":"IF(OR(AND(Proces_Elektromotor_Capaciteit=\"\",Proces_Elektromotor_Ja_Nee=\"Ja\",Proces_Elektromotor_Vermogen_Verbruik=\"Vermogen\"),\nAND(Proces_Elektromotor_Capaciteit_Dim=\"\",Proces_Elektromotor_Ja_Nee=\"Ja\",Proces_Elektromotor_Vermogen_Verbruik=\"Vermogen\")),\"▼\",\"\")","v":""},50,null,null,"m3/uur"]
[null,null,null,null,null,"EU"]
[]
[null,null,null,null,null,null,null,null,null,null,null,null,null,null,null,null,null,null,null,null,null,null,"Basis CO2 productie",null,null,null,null,null,null,null,null,10000,null,null,"kgCO2eq",null,null,null,"Basis CO2 productie",null,null,null,null,null,null,null,null,0,null,null,"gCO2eq/tkm"]
[null,null,null,null,null,null,"Detailinformatie Stap:",null,null,null,null,1]
[]
[null,null,null,null,null,null,null,null,null,null,null,null,null,null,null,null,null,null,null,null,null,null,null,null,null,null,null,null,null,{"$f":"IF(Uit_Proces_Invoer_Uitvoer_Dim=\"Uitvoer\",\"\",\"Let op CO2/MJ is op invoer\")","v":""},null,null,null,null,null,null,null,null,null,null,null,null,null,null,null,{"$f":"IF(Uit_Transport_Invoer_Uitvoer_Dim=\"Uitvoer\",\"\",\"Let op CO2/MJ is op invoer\")","v":""}]
[null,null,null,null,null,null,null,null,null,null,null,null,null,"NL",null,"EU",null,null,null,null,null,null,null,"CO2 gebaseerd op:",null,null,null,null,null,"Uitvoer",null,null,{"$f":"IF(Uit_Proces_Invoer_Uitvoer_Dim=\"Invoer\",\"van Hout\",\"naar Transport\")","v":"naar Transport"},null,null,null,null,null,null,"CO2 gebaseerd op:",null,null,null,null,null,"Uitvoer",null,null,{"$f":"IF(Uit_Transport_Invoer_Uitvoer_Dim=\"Invoer\",\"van Proces\",\"naar eindgebruiker\")","v":"naar eindgebruiker"}]
[null,null,null,null,null,null,"Teelt",null,null,null,null,null,null,{"$f":"IF(Uit_NL_Keten_Totaal_CO2<1,IF(Uit_NL_Keten_Cultivatie_CO2<0.005,\"0,00\",TEXT(Uit_NL_Keten_Cultivatie_CO2,\"#.##0,00\")),\nIF(Uit_NL_Keten_Totaal_CO2<10,IF(Uit_NL_Keten_Cultivatie_CO2<0.05,\"0,0\",TEXT(Uit_NL_Keten_Cultivatie_CO2,\"#.##0,0\")),\nIF(Uit_NL_Keten_Totaal_CO2<50,IF(Uit_NL_Keten_Cultivatie_CO2<0.5,\"0\",TEXT(Uit_NL_Keten_Cultivatie_CO2,\"#.##\")),\nIF(Uit_NL_Keten_Cultivatie_CO2<0.5,\"0\",TEXT(Uit_NL_Keten_Cultivatie_CO2,\"#.##\")))))","v":"0,0"},null,{"$f":"IF(VLOOKUP(Hout_Keten_EU,Lijst_EU_Keten,Keten_Titel_NL_EU)=\"NL\",\"\",\nIF(Uit_EU_Keten_Totaal_CO2<1,IF(Uit_EU_Keten_Cultivatie_CO2<0.005,\"0,00\",TEXT(Uit_EU_Keten_Cultivatie_CO2,\"#.##0,00\")),\nIF(Uit_EU_Keten_Totaal_CO2<10,IF(Uit_EU_Keten_Cultivatie_CO2<0.05,\"0,0\",TEXT(Uit_EU_Keten_Cultivatie_CO2,\"#.##0,0\")),\nIF(Uit_EU_Keten_Totaal_CO2<50,IF(Uit_EU_Keten_Cultivatie_CO2<0.5,\"0\",TEXT(Uit_EU_Keten_Cultivatie_CO2,\"#.##\")),\nIF(Uit_EU_Keten_Cultivatie_CO2<0.5,\"0\",TEXT(Uit_EU_Keten_Cultivatie_CO2,\"#.##\"))))))","v":"0,0"},null,"gCO2eq/MJ",null,null,null,null,null,"CO2 Verbrandingsmotor",null,null,null,null,null,{"$f":"IF(Uit_Proces_CO2T<1,IF(Uit_Proces_Brandstof_CO2<0.005,\"0,00\",TEXT(Uit_Proces_Brandstof_CO2,\"#.##0,00\")),\nIF(Uit_Proces_CO2T<10,IF(Uit_Proces_Brandstof_CO2<0.05,\"0,0\",TEXT(Uit_Proces_Brandstof_CO2,\"#.##0,0\")),\nIF(Uit_Proces_CO2T<50,IF(Uit_Proces_Brandstof_CO2<0.5,\"0\",TEXT(Uit_Proces_Brandstof_CO2,\"#.##\")),\nIF(Uit_Proces_Brandstof_CO2<0.5,\"0\",TEXT(Uit_Proces_Brandstof_CO2,\"#.##\")))))","v":"1,1"},null,null,"gCO2eq/MJ",null,null,null,null,null,null,"CO2 Verbranding",null,null,null,null,null,{"$f":"IF(Uit_Transport_CO2T<1,IF(Uit_Transport_Brandstof_CO2<0.005,\"0,00\",TEXT(Uit_Transport_Brandstof_CO2,\"#.##0,00\")),\nIF(Uit_Transport_CO2T<10,IF(Uit_Transport_Brandstof_CO2<0.05,\"0,0\",TEXT(Uit_Transport_Brandstof_CO2,\"#.##0,0\")),\nIF(Uit_Transport_CO2T<50,IF(Uit_Transport_Brandstof_CO2<0.5,\"0\",TEXT(Uit_Transport_Brandstof_CO2,\"#.##\")),\nIF(Uit_Transport_Brandstof_CO2<0.5,\"0\",TEXT(Uit_Transport_Brandstof_CO2,\"#.##\")))))","v":"0,30"},null,null,"gCO2eq/MJ"]
[null,null,null,null,null,null,"Proces",null,null,null,null,null,null,{"$f":"IF(Uit_NL_Keten_Totaal_CO2<1,IF(Uit_NL_Keten_Proces_CO2<0.005,\"0,00\",TEXT(Uit_NL_Keten_Proces_CO2,\"#.##0,00\")),\nIF(Uit_NL_Keten_Totaal_CO2<10,IF(Uit_NL_Keten_Proces_CO2<0.05,\"0,0\",TEXT(Uit_NL_Keten_Proces_CO2,\"#.##0,0\")),\nIF(Uit_NL_Keten_Totaal_CO2<50,IF(Uit_NL_Keten_Proces_CO2<0.5,\"0\",TEXT(Uit_NL_Keten_Proces_CO2,\"#.##\")),\nIF(Uit_NL_Keten_Proces_CO2<0.5,\"0\",TEXT(Uit_NL_Keten_Proces_CO2,\"#.##\")))))","v":"1,5"},null,{"$f":"IF(VLOOKUP(Hout_Keten_EU,Lijst_EU_Keten,Keten_Titel_NL_EU)=\"NL\",\"\",\nIF(Uit_EU_Keten_Totaal_CO2<1,IF(Uit_EU_Keten_Proces_CO2<0.005,\"0,00\",TEXT(Uit_EU_Keten_Proces_CO2,\"#.##0,00\")),\nIF(Uit_EU_Keten_Totaal_CO2<10,IF(Uit_EU_Keten_Proces_CO2<0.05,\"0,0\",TEXT(Uit_EU_Keten_Proces_CO2,\"#.##0,0\")),\nIF(Uit_EU_Keten_Totaal_CO2<50,IF(Uit_EU_Keten_Proces_CO2<0.5,\"0\",TEXT(Uit_EU_Keten_Proces_CO2,\"#.##\")),\nIF(Uit_EU_Keten_Proces_CO2<0.5,\"0\",TEXT(Uit_EU_Keten_Proces_CO2,\"#.##\"))))))","v":"1,8"},null,{"$f":"R70","v":"gCO2eq/MJ"},null,null,null,null,null,"CO2 Elektromotor",null,null,null,null,null,{"$f":"IF(Uit_Proces_CO2T<1,IF(Uit_Proces_Stroom_CO2<0.005,\"0,00\",TEXT(Uit_Proces_Stroom_CO2,\"#.##0,00\")),\nIF(Uit_Proces_CO2T<10,IF(Uit_Proces_Stroom_CO2<0.05,\"0,0\",TEXT(Uit_Proces_Stroom_CO2,\"#.##0,0\")),\nIF(Uit_Proces_CO2T<50,IF(Uit_Proces_Stroom_CO2<0.5,\"0\",TEXT(Uit_Proces_Stroom_CO2,\"#.##\")),\nIF(Uit_Proces_Stroom_CO2<0.5,\"0\",TEXT(Uit_Proces_Stroom_CO2,\"#.##\")))))","v":"0,0"},null,null,{"$f":"Uit_Proces_Verbrandingsmotor_CO2_Dim","v":"gCO2eq/MJ"},null,null,null,null,null,null,"CO2 Elektromotor",null,null,null,null,null,{"$f":"IF(Uit_Transport_CO2T<1,IF(Uit_Transport_Stroom_CO2<0.005,\"0,00\",TEXT(Uit_Transport_Stroom_CO2,\"#.##0,00\")),\nIF(Uit_Transport_CO2T<10,IF(Uit_Transport_Stroom_CO2<0.05,\"0,0\",TEXT(Uit_Transport_Stroom_CO2,\"#.##0,0\")),\nIF(Uit_Transport_CO2T<50,IF(Uit_Transport_Stroom_CO2<0.5,\"0\",TEXT(Uit_Transport_Stroom_CO2,\"#.##\")),\nIF(Uit_Transport_Stroom_CO2<0.5,\"0\",TEXT(Uit_Transport_Stroom_CO2,\"#.##\")))))","v":"0,00"},null,null,{"$f":"Uit_Transport_Verbrandingsmotor_CO2_Dim","v":"gCO2eq/MJ"}]
[null,null,null,null,null,null,"Transport",null,null,null,null,null,null,{"$f":"IF(Uit_NL_Keten_Totaal_CO2<1,IF(Uit_NL_Keten_Transport_CO2<0.005,\"0,00\",TEXT(Uit_NL_Keten_Transport_CO2,\"#.##0,00\")),\nIF(Uit_NL_Keten_Totaal_CO2<10,IF(Uit_NL_Keten_Transport_CO2<0.05,\"0,0\",TEXT(Uit_NL_Keten_Transport_CO2,\"#.##0,0\")),\nIF(Uit_NL_Keten_Totaal_CO2<50,IF(Uit_NL_Keten_Transport_CO2<0.5,\"0\",TEXT(Uit_NL_Keten_Transport_CO2,\"#.##\")),\nIF(Uit_NL_Keten_Transport_CO2<0.5,\"0\",TEXT(Uit_NL_Keten_Transport_CO2,\"#.##\")))))","v":"0,9"},null,{"$f":"IF(VLOOKUP(Hout_Keten_EU,Lijst_EU_Keten,Keten_Titel_NL_EU)=\"NL\",\"\",\nIF(Uit_EU_Keten_Totaal_CO2<1,IF(Uit_EU_Keten_Transport_CO2<0.005,\"0,00\",TEXT(Uit_EU_Keten_Transport_CO2,\"#.##0,00\")),\nIF(Uit_EU_Keten_Totaal_CO2<10,IF(Uit_EU_Keten_Transport_CO2<0.05,\"0,0\",TEXT(Uit_EU_Keten_Transport_CO2,\"#.##0,0\")),\nIF(Uit_EU_Keten_Totaal_CO2<50,IF(Uit_EU_Keten_Transport_CO2<0.5,\"0\",TEXT(Uit_EU_Keten_Transport_CO2,\"#.##\")),\nIF(Uit_EU_Keten_Transport_CO2<0.5,\"0\",TEXT(Uit_EU_Keten_Transport_CO2,\"#.##\"))))))","v":"3,0"},null,{"$f":"R70","v":"gCO2eq/MJ"},null,null,null,null,null,"CO2 Basis",null,null,null,null,null,{"$f":"IF(Uit_Proces_CO2T<1,IF(Uit_Proces_Basis_CO2<0.005,\"0,00\",TEXT(Uit_Proces_Basis_CO2,\"#.##0,00\")),\nIF(Uit_Proces_CO2T<10,IF(Uit_Proces_Basis_CO2<0.05,\"0,0\",TEXT(Uit_Proces_Basis_CO2,\"#.##0,0\")),\nIF(Uit_Proces_CO2T<50,IF(Uit_Proces_Basis_CO2<0.5,\"0\",TEXT(Uit_Proces_Basis_CO2,\"#.##\")),\nIF(Uit_Proces_Basis_CO2<0.5,\"0\",TEXT(Uit_Proces_Basis_CO2,\"#.##\")))))","v":"0,3"},null,null,{"$f":"Uit_Proces_Verbrandingsmotor_CO2_Dim","v":"gCO2eq/MJ"},null,null,null,null,null,null,"CO2 Basis",null,null,null,null,null,{"$f":"IF(Uit_Transport_CO2T<1,IF(Uit_Transport_Basis_CO2<0.005,\"0,00\",TEXT(Uit_Transport_Basis_CO2,\"#.##0,00\")),\nIF(Uit_Transport_CO2T<10,IF(Uit_Transport_Basis_CO2<0.05,\"0,0\",TEXT(Uit_Transport_Basis_CO2,\"#.##0,0\")),\nIF(Uit_Transport_CO2T<50,IF(Uit_Transport_Basis_CO2<0.5,\"0\",TEXT(Uit_Transport_Basis_CO2,\"#.##\")),\nIF(Uit_Transport_Basis_CO2<0.5,\"0\",TEXT(Uit_Transport_Basis_CO2,\"#.##\")))))","v":"0,00"},null,null,{"$f":"Uit_Transport_Verbrandingsmotor_CO2_Dim","v":"gCO2eq/MJ"}]
[null,null,null,null,null,null,"Totaal",null,null,null,null,null,null,{"$f":"IF(Uit_NL_Keten_Totaal_CO2<1,IF(Uit_NL_Keten_Totaal_CO2<0.005,\"0,00\",TEXT(Uit_NL_Keten_Totaal_CO2,\"#.##0,00\")),\nIF(Uit_NL_Keten_Totaal_CO2<10,IF(Uit_NL_Keten_Totaal_CO2<0.05,\"0,0\",TEXT(Uit_NL_Keten_Totaal_CO2,\"#.##0,0\")),\nIF(Uit_NL_Keten_Totaal_CO2<50,IF(Uit_NL_Keten_Totaal_CO2<0.5,\"0\",TEXT(Uit_NL_Keten_Totaal_CO2,\"#.##\")),\nIF(Uit_NL_Keten_Totaal_CO2<0.5,\"0\",TEXT(Uit_NL_Keten_Totaal_CO2,\"#.##\")))))","v":"2,4"},null,{"$f":"IF(VLOOKUP(Hout_Keten_EU,Lijst_EU_Keten,Keten_Titel_NL_EU)=\"NL\",\"\",\nIF(Uit_EU_Keten_Totaal_CO2<1,IF(Uit_EU_Keten_Totaal_CO2<0.005,\"0,00\",TEXT(Uit_EU_Keten_Totaal_CO2,\"#.##0,00\")),\nIF(Uit_EU_Keten_Totaal_CO2<10,IF(Uit_EU_Keten_Totaal_CO2<0.05,\"0,0\",TEXT(Uit_EU_Keten_Totaal_CO2,\"#.##0,0\")),\nIF(Uit_EU_Keten_Totaal_CO2<50,IF(Uit_EU_Keten_Totaal_CO2<0.5,\"0\",TEXT(Uit_EU_Keten_Totaal_CO2,\"#.##\")),\nIF(Uit_EU_Keten_Totaal_CO2<0.5,\"0\",TEXT(Uit_EU_Keten_Totaal_CO2,\"#.##\"))))))","v":"4,8"},null,{"$f":"R70","v":"gCO2eq/MJ"},null,null,null,null,null,"CO2 Totaal",null,null,null,null,null,{"$f":"IF(Uit_Proces_CO2T<1,IF(Uit_Proces_CO2T<0.005,\"0,00\",TEXT(Uit_Proces_CO2T,\"#.##0,00\")),\nIF(Uit_Proces_CO2T<10,IF(Uit_Proces_CO2T<0.05,\"0,0\",TEXT(Uit_Proces_CO2T,\"#.##0,0\")),\nIF(Uit_Proces_CO2T<50,IF(Uit_Proces_CO2T<0.5,\"0\",TEXT(Uit_Proces_CO2T,\"#.##\")),\nIF(Uit_Proces_CO2T<0.5,\"0\",TEXT(Uit_Proces_CO2T,\"#.##\")))))","v":"1,4"},null,null,{"$f":"Uit_Proces_Verbrandingsmotor_CO2_Dim","v":"gCO2eq/MJ"},null,null,null,null,null,null,"CO2 Totaal",null,null,null,null,null,{"$f":"IF(Uit_Transport_CO2T<1,IF(Uit_Transport_CO2T<0.005,\"0,00\",TEXT(Uit_Transport_CO2T,\"#.##0,00\")),\nIF(Uit_Transport_CO2T<10,IF(Uit_Transport_CO2T<0.05,\"0,0\",TEXT(Uit_Transport_CO2T,\"#.##0,0\")),\nIF(Uit_Transport_CO2T<50,IF(Uit_Transport_CO2T<0.5,\"0\",TEXT(Uit_Transport_CO2T,\"#.##\")),\nIF(Uit_Transport_CO2T<0.5,\"0\",TEXT(Uit_Transport_CO2T,\"#.##\")))))","v":"0,30"},null,null,{"$f":"Uit_Transport_Verbrandingsmotor_CO2_Dim","v":"gCO2eq/MJ"}]
[]
[null,null,null,null,null,"© Dit rekenmodel is eigendom van KandT/Zilverberg. Er kunnen aan het gebruik van het rekenmodel geen rechten worden ontleend"]
[]
[null,null,"Het E-Land CO2 programma bestaat uit een aantal secties die hieronder zijn aangegegeven"]
[]
[null,null,null,"Biomassa",null,null,null,null,null,null,null,null,null,null,null,null,null,null,null,null,null,"Proces",null,null,null,null,null,null,null,null,null,null,null,null,null,null,null,null,null,"Transport"]
[]
[null,null,null,"1-1 In deze sectie worden de resultaten voor de gekozen keten samengevat.",null,null,null,null,null,null,null,null,null,null,null,null,null,null,null,null,null,"2-1 In deze sectie worden de resultaten voor de gekozen Proces samengevat.",null,null,null,null,null,null,null,null,null,null,null,null,null,null,null,null,null,"3-1 In deze sectie worden de resultaten voor de gekozen Transsport samengevat."]
[]
[]
[]
[null,null,null,"1-2 In deze sectie kunnen de invoergegevens voor de biomassa worden aangegeven.\nIn deze sectie kan ook worden aangegeven welke de bronnen zijn voor het bepalen van de CO2 emissiefactoren",null,null,null,null,null,null,null,null,null,null,null,null,null,null,null,null,null,"2-2 In deze sectie kunnen de invoergegevens voor een Proces worden aangegeven. \nHet Proces kan worden uitgevoerd met behulp van apparaten die op een brandstof op op elektriciteit werken.",null,null,null,null,null,null,null,null,null,null,null,null,null,null,null,null,null,"3-2 In deze sectie kunnen de invoergegevens voor een Transport worden aangegeven. \nHet Transport kan worden uitgevoerd met behulp van voertuigen op basis van een verbrandingsmotor en/of voertuigen met een elektrische aandrijving."]
[]
[]
[]
[]
[]
[null,null,null,"1-3 In deze sectie kunnen de gegevens voor een bepaalde keten worden ingevoerd. Getoond worden de equivalente CO2 emissies voor de Teelt, de Processen en de Transporten in de keten. \nTevens worden voor de gekozen keten de equivalente CO2 emissies voor de afzonderlijke stappen in de keten getoond.\nDe te kiezen ketens zijn zowel in Europa geaccepteerde ketens als specifieke Nederlandse ketens."]
[]
[]
[]
[]
[]
[]
[]
[]
[]
[]
[null,null,null,"1-4 In deze sectie worden de resultaten voor de gekozen keten samengevat.",null,null,null,null,null,null,null,null,null,null,null,null,null,null,null,null,null,"2-3 In deze sectie worden de resultaten voor de gekozen Proces samengevat.",null,null,null,null,null,null,null,null,null,null,null,null,null,null,null,null,null,"3-3 In deze sectie worden de resultaten voor de gekozen Transsport samengevat."]
[]
[]
[]
[]
[null,null,"Voor het uitvoeren van de berekeningen zijn basisdata nodig. Het betreft data voor de verschillende biomassaketens, fysische eigenschappen van de verschillende te gebruiken brandstoffen (benzine, diesel, aardgas, etc), CO2 emissiefactoren voor de verschillende brandstoffen en elektriciteit (Elekriciteit-NL, eleektriciteit-EU, etc.), De Global Warming Potentials, houteigenschappen en de vorm van het hout (chips, shreds, etc.). De basisdata zijn afkomstig van de dataverzameling zoals gehanteerd door de Europese Unie en zoals weergegeven in het JRC document. \nEen veel gebruikte data set in het JRC document is hiernaast weergegeven.",null,null,null,null,null,null,null,null,null,null,null,null,null,null,null,null,null,null,null,null,null,null,null,null,null,null,"Dichtheid hout (fijnspar)",null,null,null,null,null,null,null,null,null,null,null,null,425,null,null,"kgds/m3"]
[null,null,null,null,null,null,null,null,null,null,null,null,null,null,null,null,null,null,null,null,null,null,null,null,null,null,null,null,null,"Energiewaarde hout",null,null,null,null,null,null,null,null,null,null,null,null,19,null,null,"MJ/kgds"]
[null,null,null,null,null,null,null,null,null,null,null,null,null,null,null,null,null,null,null,null,null,null,null,null,null,null,null,null,null,"Energiewaarde diesel",null,null,null,null,null,null,null,null,null,null,null,null,36,null,null,"MJ/liter"]
[null,null,null,null,null,null,null,null,null,null,null,null,null,null,null,null,null,null,null,null,null,null,null,null,null,null,null,null,null,"Dieselverbruik 40 ton truck",null,null,null,null,null,null,null,null,null,null,null,null,30.53,null,null,"liter/100km"]
[null,null,null,null,null,null,null,null,null,null,null,null,null,null,null,null,null,null,null,null,null,null,null,null,null,null,null,null,null,"Belading",null,null,null,null,null,null,null,null,null,null,null,null,50,null,null,"%"]
[null,null,null,null,null,null,null,null,null,null,null,null,null,null,null,null,null,null,null,null,null,null,null,null,null,null,null,null,null,"CO2 diesel",null,null,null,null,null,null,null,null,null,null,null,null,95.1,null,null,"gCO2/MJ"]
[]
[null,null,null,null,null,null,null,null,null,null,null,null,null,null,null,null,null,null,null,null,null,null,null,null,null,null,null,null,null,"Vrachtwagen",null,null,null,null,null,null,null,null,null,null,null,null,40,null,null,"ton"]
[null,null,null,null,null,null,null,null,null,null,null,null,null,null,null,null,null,null,null,null,null,null,null,null,null,null,null,null,null,"Pay load vrachtwagen",null,null,null,null,null,null,null,null,null,null,null,null,27,null,null,"ton"]
[]
[]
[null,null,null,null,null,null,null,null,null,null,null,"NL",null,"EU",null,null,null,null,null,"Hier kan een keuze gemaakt worden voor EU waarden of NL waarden"]
[null,null,null,null,null,null,null,null,null,"CO2eq",{"$f":"IF(Samenvatting_NL_Keten_CO2<10,TEXT(Samenvatting_NL_Keten_CO2,\"#.##0,0\"),TEXT(Samenvatting_NL_Keten_CO2,\"#.##\"))","v":"82.037"},null,{"$f":"IF(VLOOKUP(Hout_Keten_EU,Lijst_EU_Keten,Keten_Titel_NL_EU)=\"NL\",\"\",\nIF(Samenvatting_EU_Keten_CO2<10,TEXT(Samenvatting_EU_Keten_CO2,\"#.##0,0\"),TEXT(Samenvatting_EU_Keten_CO2,\"#.##\")))","v":"165.106"},null,"kgCO2eq",null,null,null,null,"Totale CO2eq emissie van het Proces.",null,null,null,null,null,null,null,null,null,null,"Eenhedenkeuze:",null,null,null,null,"gCO2eq - kgCO2eq - tonCO2eq - MtonCO2eq"]
[null,null,null,null,null,null,null,null,null,"Doorzet",{"$f":"IF(Samenvatting_Hout_Doorzet<10,TEXT(Samenvatting_Hout_Doorzet,\"#.##0,0\"),TEXT(Samenvatting_Hout_Doorzet,\"#.##\"))","v":"1.803"},null,{"$f":"IF(VLOOKUP(Hout_Keten_EU,Lijst_EU_Keten,Keten_Titel_NL_EU)=\"NL\",\"\",\nIF(Samenvatting_Hout_Doorzet<10,TEXT(Samenvatting_Hout_Doorzet,\"#.##0,0\"),TEXT(Samenvatting_Hout_Doorzet,\"#.##\")))","v":"1.803"},null,"tonds",null,null,null,null,"Doorzet van biomassa door het Proces",null,null,null,null,null,null,null,null,null,null,"Eenhedenkeuze:",null,null,null,null,"m3 - kg - kgds - ton - tonds - MJ - GJ - kWh - MWh"]
[null,null,null,null,null,null,null,null,null,"CO2eq/Doorzet",{"$f":"IF(K119/K120<10,TEXT(K119/K120,\"#.##0,0\"),TEXT(K119/K120,\"#.##\"))","v":"46"},null,{"$f":"IF(VLOOKUP(Hout_Keten_EU,Lijst_EU_Keten,Keten_Titel_NL_EU)=\"NL\",\"\",\nIF(M119/M120<10,TEXT(M119/M120,\"#.##0,0\"),TEXT(M119/M120,\"#.##\")))","v":"92"},null,{"$f":"Samenvatting_Hout_CO2T_Dim&\"/\"&Samenvatting_Hout_Doorzet_Dim","v":"kgCO2eq/tonds"},null,null,null,null,"Verhouding van CO2eq en Doorzet",null,null,null,null,null,null,null,null,null,null,"Eenhedenkeuze:",null,null,null,null,"Geen, waarde wordt berekend uit CO2eq en Doorzet"]
[null,null,"©KandT/Zilverberg"]
[]
[null,null,null,"Opmerkingen:"]
[null,null,null,null,null,null,null,null,null,null,null,null,null,null,null,null,null,null,null,"Opmerkingen vrij in te vullen"]
[]
[]
[]
[null,null,null,"Omschrijving",null,null,null,"Levering Biomassacentrale Texel",null,null,null,null,null,null,null,null,null,null,null,"Omschrijving van de levering vrij in te vullen"]
[null,null,null,"Houtsoort",null,null,null,null,null,null,"Loofhout mix NL",null,null,null,null,null,null,null,null,"Houtsoort",null,null,null,null,null,null,null,null,null,null,"Keuze uit:",null,null,null,null,"Datalijst met Houtsoort"]
[null,null,null,"Houtvorm oogst",null,null,null,null,null,null,"Top- en takhout",null,null,null,null,null,null,null,null,"Houtvorm ",null,null,null,null,null,null,null,null,null,null,"Keuze uit:",null,null,null,null,"Datalijst met Houtvorm"]
[null,null,null,"Vochtigheid / vochtgehalte oogst",null,null,null,null,null,null,null,null,50,null,null,{"$f":"Uit_Hout_Vochtgehalte","v":100},"%",null,null,"Vochtigheid van de biomassa vrij in te vullen"]
[null,null,null,"Hoeveelheid",null,null,"naar eindgebruiker",null,null,null,null,null,10000,null,null,"m3",null,null,null,"Hoeveelheid",null,null,null,null,null,null,null,null,null,null,"Eenhedenkeuze:",null,null,null,null,"uit oogst - naar eindgebruiker"]
[null,null,null,null,null,null,null,null,null,null,null,null,null,null,null,null,null,null,null,"Hoeveelheid",null,null,null,null,null,null,null,null,null,null,"Eenhedenkeuze:",null,null,null,null,"m3 - kg - kgds - ton - tonds - MJ - GJ - kWh - MWh"]
[null,null,null,"CO2 Emissiefactoren volgens",null,null,null,null,null,null,"BioGrace - II",null,null,null,null,null,null,null,null,"Keuzeknop voor data uit de BioGrace II vezameling data"]
[null,null,null,null,null,null,null,null,null,null,"CO2 emissiefactoren - 2018",null,null,null,null,null,null,null,null,"Keuzeknop voor data uit de CO2 emissiefactoren vezameling data"]
[null,null,null,null,null,null,null,null,null,null,"Beide",null,null,null,null,null,null,null,null,"Keuzeknop voor beide dataverzamelingen"]
[]
[]
[null,null,null,"Keten",null,null,"1a-Chips uit top- en tak hout uit bos of landschap",null,null,null,null,null,null,null,null,null,null,null,null,"Standaardketen",null,null,null,null,null,null,null,null,null,null,"Keuze uit:",null,null,null,null,"Datalijst standaard biomassaketens"]
[null,null,null,"Pathway",null,null,{"$f":"LOOKUP(Hout_Keten_NL,Lijst_NL_Keten_Nr_Titel,Lijst_EU_Keten_Nr_Titel)","v":"1a-Woodchips from forest residues"}]
[null,null,null,"Ketenstappen",null,null,null,null,null,null,"NL",null,"EU"]
[null,null,{"$f":"IF(VLOOKUP(Hout_Keten_NL,Lijst_NL_Keten,11)=\"\",\"\",1)","v":1},{"$f":"IF(VLOOKUP(Hout_Keten_NL,Lijst_NL_Keten,11)=\"\",\"\",VLOOKUP(Hout_Keten_NL,Lijst_NL_Keten,11))","v":"Inzamelen top- en takhout"},null,null,null,null,null,null,{"$f":"IF(VLOOKUP(Hout_Keten_NL,Lijst_NL_Keten,Keten_Stap1+0*Keten_Delta)=\"\",\"\",\nIF(Uit_NL_Keten_Totaal_CO2<1,IF(Uit_NL_Keten_Stap1_CO2<0.005,\"0,00\",TEXT(Uit_NL_Keten_Stap1_CO2,\"#.##0,00\")),\nIF(Uit_NL_Keten_Totaal_CO2<10,IF(Uit_NL_Keten_Stap1_CO2<0.05,\"0,0\",TEXT(Uit_NL_Keten_Stap1_CO2,\"#.##0,0\")),\nIF(Uit_NL_Keten_Totaal_CO2<50,IF(Uit_NL_Keten_Stap1_CO2<0.5,\"0\",TEXT(Uit_NL_Keten_Stap1_CO2,\"#.##\")),\nIF(Uit_NL_Keten_Stap1_CO2<0.5,\"0\",TEXT(Uit_NL_Keten_Stap1_CO2,\"#.##\"))))))","v":"0,8"},null,{"$f":"IF(VLOOKUP(Hout_Keten_NL,Lijst_NL_Keten,Keten_Stap1+0*Keten_Delta)=\"\",\"\",\nIF(Uit_NL_Keten_Totaal_CO2<1,IF(Uit_EU_Keten_Stap1_CO2<0.005,\"0,00\",TEXT(Uit_EU_Keten_Stap1_CO2,\"#.##0,00\")),\nIF(Uit_NL_Keten_Totaal_CO2<10,IF(Uit_EU_Keten_Stap1_CO2<0.05,\"0,0\",TEXT(Uit_EU_Keten_Stap1_CO2,\"#.##0,0\")),\nIF(Uit_NL_Keten_Totaal_CO2<50,IF(Uit_EU_Keten_Stap1_CO2<0.5,\"0\",TEXT(Uit_EU_Keten_Stap1_CO2,\"#.##\")),\nIF(Uit_EU_Keten_Stap1_CO2<0.5,\"0\",TEXT(Uit_EU_Keten_Stap1_CO2,\"#.##\"))))))","v":"1,5"},null,{"$f":"IF(VLOOKUP(Hout_Keten_NL,Lijst_NL_Keten,Keten_Stap1+0*Keten_Delta)=\"\",\"\",Uit_NL_EU_Keten_CO2_Dim)","v":"gCO2eq/MJ"},null,null,{"$f":"IF(VLOOKUP(Hout_Keten_NL,Lijst_NL_Keten,Keten_Stap1_CPT+0*Keten_Delta)=\"\",\"\",VLOOKUP(Hout_Keten_NL,Lijst_NL_Keten,Keten_Stap1_CPT+0*Keten_Delta))","v":"P"},null,"Stappen van de gekozen biomassaketen",null,null,null,null,null,null,null,null,null,null,"Eenheden",null,null,null,null,"Worden bepaald door eenhedenkeuze in sectie 1-4"]
[null,null,{"$f":"IF(VLOOKUP(Hout_Keten_NL,Lijst_NL_Keten,22)=\"\",\"\",2)","v":2},{"$f":"IF(VLOOKUP(Hout_Keten_NL,Lijst_NL_Keten,22)=\"\",\"\",VLOOKUP(Hout_Keten_NL,Lijst_NL_Keten,22))","v":"Drogen langs de weg"},null,null,null,null,null,null,{"$f":"IF(VLOOKUP(Hout_Keten_NL,Lijst_NL_Keten,Keten_Stap1+1*Keten_Delta)=\"\",\"\",\nIF(Uit_NL_Keten_Totaal_CO2<1,IF(Uit_NL_Keten_Stap2_CO2<0.005,\"0,00\",TEXT(Uit_NL_Keten_Stap2_CO2,\"#.##0,00\")),\nIF(Uit_NL_Keten_Totaal_CO2<10,IF(Uit_NL_Keten_Stap2_CO2<0.05,\"0,0\",TEXT(Uit_NL_Keten_Stap2_CO2,\"#.##0,0\")),\nIF(Uit_NL_Keten_Totaal_CO2<50,IF(Uit_NL_Keten_Stap2_CO2<0.5,\"0\",TEXT(Uit_NL_Keten_Stap2_CO2,\"#.##\")),\nIF(Uit_NL_Keten_Stap2_CO2<0.5,\"0\",TEXT(Uit_NL_Keten_Stap2_CO2,\"#.##\"))))))","v":"0,0"},null,{"$f":"IF(VLOOKUP(Hout_Keten_NL,Lijst_NL_Keten,Keten_Stap1+1*Keten_Delta)=\"\",\"\",\nIF(Uit_NL_Keten_Totaal_CO2<1,IF(Uit_EU_Keten_Stap2_CO2<0.005,\"0,00\",TEXT(Uit_EU_Keten_Stap2_CO2,\"#.##0,00\")),\nIF(Uit_NL_Keten_Totaal_CO2<10,IF(Uit_EU_Keten_Stap2_CO2<0.05,\"0,0\",TEXT(Uit_EU_Keten_Stap2_CO2,\"#.##0,0\")),\nIF(Uit_NL_Keten_Totaal_CO2<50,IF(Uit_EU_Keten_Stap2_CO2<0.5,\"0\",TEXT(Uit_EU_Keten_Stap2_CO2,\"#.##\")),\nIF(Uit_EU_Keten_Stap2_CO2<0.5,\"0\",TEXT(Uit_EU_Keten_Stap2_CO2,\"#.##\"))))))","v":"0,0"},null,{"$f":"IF(VLOOKUP(Hout_Keten_NL,Lijst_NL_Keten,Keten_Stap1+1*Keten_Delta)=\"\",\"\",Uit_NL_EU_Keten_CO2_Dim)","v":"gCO2eq/MJ"},null,null,{"$f":"IF(VLOOKUP(Hout_Keten_NL,Lijst_NL_Keten,Keten_Stap1_CPT+1*Keten_Delta)=\"\",\"\",VLOOKUP(Hout_Keten_NL,Lijst_NL_Keten,Keten_Stap1_CPT+1*Keten_Delta))","v":"P"}]
[null,null,{"$f":"IF(VLOOKUP(Hout_Keten_NL,Lijst_NL_Keten,33)=\"\",\"\",3)","v":3},{"$f":"IF(VLOOKUP(Hout_Keten_NL,Lijst_NL_Keten,33)=\"\",\"\",VLOOKUP(Hout_Keten_NL,Lijst_NL_Keten,33))","v":"Chippen"},null,null,null,null,null,null,{"$f":"IF(VLOOKUP(Hout_Keten_NL,Lijst_NL_Keten,Keten_Stap1+2*Keten_Delta)=\"\",\"\",\nIF(Uit_NL_Keten_Totaal_CO2<1,IF(Uit_NL_Keten_Stap3_CO2<0.005,\"0,00\",TEXT(Uit_NL_Keten_Stap3_CO2,\"#.##0,00\")),\nIF(Uit_NL_Keten_Totaal_CO2<10,IF(Uit_NL_Keten_Stap3_CO2<0.05,\"0,0\",TEXT(Uit_NL_Keten_Stap3_CO2,\"#.##0,0\")),\nIF(Uit_NL_Keten_Totaal_CO2<50,IF(Uit_NL_Keten_Stap3_CO2<0.5,\"0\",TEXT(Uit_NL_Keten_Stap3_CO2,\"#.##\")),\nIF(Uit_NL_Keten_Stap3_CO2<0.5,\"0\",TEXT(Uit_NL_Keten_Stap3_CO2,\"#.##\"))))))","v":"0,7"},null,{"$f":"IF(VLOOKUP(Hout_Keten_NL,Lijst_NL_Keten,Keten_Stap1+2*Keten_Delta)=\"\",\"\",\nIF(Uit_NL_Keten_Totaal_CO2<1,IF(Uit_EU_Keten_Stap3_CO2<0.005,\"0,00\",TEXT(Uit_EU_Keten_Stap3_CO2,\"#.##0,00\")),\nIF(Uit_NL_Keten_Totaal_CO2<10,IF(Uit_EU_Keten_Stap3_CO2<0.05,\"0,0\",TEXT(Uit_EU_Keten_Stap3_CO2,\"#.##0,0\")),\nIF(Uit_NL_Keten_Totaal_CO2<50,IF(Uit_EU_Keten_Stap3_CO2<0.5,\"0\",TEXT(Uit_EU_Keten_Stap3_CO2,\"#.##\")),\nIF(Uit_EU_Keten_Stap3_CO2<0.5,\"0\",TEXT(Uit_EU_Keten_Stap3_CO2,\"#.##\"))))))","v":"0,4"},null,{"$f":"IF(VLOOKUP(Hout_Keten_NL,Lijst_NL_Keten,Keten_Stap1+2*Keten_Delta)=\"\",\"\",Uit_NL_EU_Keten_CO2_Dim)","v":"gCO2eq/MJ"},null,null,{"$f":"IF(VLOOKUP(Hout_Keten_NL,Lijst_NL_Keten,Keten_Stap1_CPT+2*Keten_Delta)=\"\",\"\",VLOOKUP(Hout_Keten_NL,Lijst_NL_Keten,Keten_Stap1_CPT+2*Keten_Delta))","v":"P"}]
[null,null,{"$f":"IF(VLOOKUP(Hout_Keten_NL,Lijst_NL_Keten,44)=\"\",\"\",4)","v":4},{"$f":"IF(VLOOKUP(Hout_Keten_NL,Lijst_NL_Keten,44)=\"\",\"\",VLOOKUP(Hout_Keten_NL,Lijst_NL_Keten,44))","v":"Transport chips naar afnemer"},null,null,null,null,null,null,{"$f":"IF(VLOOKUP(Hout_Keten_NL,Lijst_NL_Keten,Keten_Stap1+3*Keten_Delta)=\"\",\"\",\nIF(Uit_NL_Keten_Totaal_CO2<1,IF(Uit_NL_Keten_Stap4_CO2<0.005,\"0,00\",TEXT(Uit_NL_Keten_Stap4_CO2,\"#.##0,00\")),\nIF(Uit_NL_Keten_Totaal_CO2<10,IF(Uit_NL_Keten_Stap4_CO2<0.05,\"0,0\",TEXT(Uit_NL_Keten_Stap4_CO2,\"#.##0,0\")),\nIF(Uit_NL_Keten_Totaal_CO2<50,IF(Uit_NL_Keten_Stap4_CO2<0.5,\"0\",TEXT(Uit_NL_Keten_Stap4_CO2,\"#.##\")),\nIF(Uit_NL_Keten_Stap4_CO2<0.5,\"0\",TEXT(Uit_NL_Keten_Stap4_CO2,\"#.##\"))))))","v":"0,9"},null,{"$f":"IF(VLOOKUP(Hout_Keten_NL,Lijst_NL_Keten,Keten_Stap1+3*Keten_Delta)=\"\",\"\",\nIF(Uit_NL_Keten_Totaal_CO2<1,IF(Uit_EU_Keten_Stap4_CO2<0.005,\"0,00\",TEXT(Uit_EU_Keten_Stap4_CO2,\"#.##0,00\")),\nIF(Uit_NL_Keten_Totaal_CO2<10,IF(Uit_EU_Keten_Stap4_CO2<0.05,\"0,0\",TEXT(Uit_EU_Keten_Stap4_CO2,\"#.##0,0\")),\nIF(Uit_NL_Keten_Totaal_CO2<50,IF(Uit_EU_Keten_Stap4_CO2<0.5,\"0\",TEXT(Uit_EU_Keten_Stap4_CO2,\"#.##\")),\nIF(Uit_EU_Keten_Stap4_CO2<0.5,\"0\",TEXT(Uit_EU_Keten_Stap4_CO2,\"#.##\"))))))","v":"3,0"},null,{"$f":"IF(VLOOKUP(Hout_Keten_NL,Lijst_NL_Keten,Keten_Stap1+3*Keten_Delta)=\"\",\"\",Uit_NL_EU_Keten_CO2_Dim)","v":"gCO2eq/MJ"},null,null,{"$f":"IF(VLOOKUP(Hout_Keten_NL,Lijst_NL_Keten,Keten_Stap1_CPT+3*Keten_Delta)=\"\",\"\",VLOOKUP(Hout_Keten_NL,Lijst_NL_Keten,Keten_Stap1_CPT+3*Keten_Delta))","v":"T"}]
[null,null,{"$f":"IF(VLOOKUP(Hout_Keten_NL,Lijst_NL_Keten,55)=\"\",\"\",5)","v":""},{"$f":"IF(VLOOKUP(Hout_Keten_NL,Lijst_NL_Keten,55)=\"\",\"\",VLOOKUP(Hout_Keten_NL,Lijst_NL_Keten,55))","v":""},null,null,null,null,null,null,{"$f":"IF(VLOOKUP(Hout_Keten_NL,Lijst_NL_Keten,Keten_Stap1+4*Keten_Delta)=\"\",\"\",\nIF(Uit_NL_Keten_Totaal_CO2<1,IF(Uit_NL_Keten_Stap5_CO2<0.005,\"0,00\",TEXT(Uit_NL_Keten_Stap5_CO2,\"#.##0,00\")),\nIF(Uit_NL_Keten_Totaal_CO2<10,IF(Uit_NL_Keten_Stap5_CO2<0.05,\"0,0\",TEXT(Uit_NL_Keten_Stap5_CO2,\"#.##0,0\")),\nIF(Uit_NL_Keten_Totaal_CO2<50,IF(Uit_NL_Keten_Stap5_CO2<0.5,\"0\",TEXT(Uit_NL_Keten_Stap5_CO2,\"#.##\")),\nIF(Uit_NL_Keten_Stap5_CO2<0.5,\"0\",TEXT(Uit_NL_Keten_Stap5_CO2,\"#.##\"))))))","v":""},null,{"$f":"IF(VLOOKUP(Hout_Keten_NL,Lijst_NL_Keten,Keten_Stap1+4*Keten_Delta)=\"\",\"\",\nIF(Uit_NL_Keten_Totaal_CO2<1,IF(Uit_EU_Keten_Stap5_CO2<0.005,\"0,00\",TEXT(Uit_EU_Keten_Stap5_CO2,\"#.##0,00\")),\nIF(Uit_NL_Keten_Totaal_CO2<10,IF(Uit_EU_Keten_Stap5_CO2<0.05,\"0,0\",TEXT(Uit_EU_Keten_Stap5_CO2,\"#.##0,0\")),\nIF(Uit_NL_Keten_Totaal_CO2<50,IF(Uit_EU_Keten_Stap5_CO2<0.5,\"0\",TEXT(Uit_EU_Keten_Stap5_CO2,\"#.##\")),\nIF(Uit_EU_Keten_Stap5_CO2<0.5,\"0\",TEXT(Uit_EU_Keten_Stap5_CO2,\"#.##\"))))))","v":""},null,{"$f":"IF(VLOOKUP(Hout_Keten_NL,Lijst_NL_Keten,Keten_Stap1+4*Keten_Delta)=\"\",\"\",Uit_NL_EU_Keten_CO2_Dim)","v":""},null,null,{"$f":"IF(VLOOKUP(Hout_Keten_NL,Lijst_NL_Keten,Keten_Stap1_CPT+4*Keten_Delta)=\"\",\"\",VLOOKUP(Hout_Keten_NL,Lijst_NL_Keten,Keten_Stap1_CPT+4*Keten_Delta))","v":""}]
[null,null,{"$f":"IF(VLOOKUP(Hout_Keten_NL,Lijst_NL_Keten,77)=\"\",\"\",6)","v":""},{"$f":"IF(VLOOKUP(Hout_Keten_NL,Lijst_NL_Keten,63)=\"\",\"\",VLOOKUP(Hout_Keten_NL,Lijst_NL_Keten,63))","v":""},null,null,null,null,null,null,{"$f":"IF(VLOOKUP(Hout_Keten_NL,Lijst_NL_Keten,Keten_Stap1+5*Keten_Delta)=\"\",\"\",\nIF(Uit_NL_Keten_Totaal_CO2<1,IF(Uit_NL_Keten_Stap6_CO2<0.005,\"0,00\",TEXT(Uit_NL_Keten_Stap6_CO2,\"#.##0,00\")),\nIF(Uit_NL_Keten_Totaal_CO2<10,IF(Uit_NL_Keten_Stap6_CO2<0.05,\"0,0\",TEXT(Uit_NL_Keten_Stap6_CO2,\"#.##0,0\")),\nIF(Uit_NL_Keten_Totaal_CO2<50,IF(Uit_NL_Keten_Stap6_CO2<0.5,\"0\",TEXT(Uit_NL_Keten_Stap6_CO2,\"#.##\")),\nIF(Uit_NL_Keten_Stap6_CO2<0.5,\"0\",TEXT(Uit_NL_Keten_Stap6_CO2,\"#.##\"))))))","v":""},null,{"$f":"IF(VLOOKUP(Hout_Keten_NL,Lijst_NL_Keten,Keten_Stap1+5*Keten_Delta)=\"\",\"\",\nIF(Uit_NL_Keten_Totaal_CO2<1,IF(Uit_EU_Keten_Stap6_CO2<0.005,\"0,00\",TEXT(Uit_EU_Keten_Stap6_CO2,\"#.##0,00\")),\nIF(Uit_NL_Keten_Totaal_CO2<10,IF(Uit_EU_Keten_Stap6_CO2<0.05,\"0,0\",TEXT(Uit_EU_Keten_Stap6_CO2,\"#.##0,0\")),\nIF(Uit_NL_Keten_Totaal_CO2<50,IF(Uit_EU_Keten_Stap6_CO2<0.5,\"0\",TEXT(Uit_EU_Keten_Stap6_CO2,\"#.##\")),\nIF(Uit_EU_Keten_Stap6_CO2<0.5,\"0\",TEXT(Uit_EU_Keten_Stap6_CO2,\"#.##\"))))))","v":""},null,{"$f":"IF(VLOOKUP(Hout_Keten_NL,Lijst_NL_Keten,Keten_Stap1+5*Keten_Delta)=\"\",\"\",Uit_NL_EU_Keten_CO2_Dim)","v":""},null,null,{"$f":"IF(VLOOKUP(Hout_Keten_NL,Lijst_NL_Keten,Keten_Stap1_CPT+5*Keten_Delta)=\"\",\"\",VLOOKUP(Hout_Keten_NL,Lijst_NL_Keten,Keten_Stap1_CPT+5*Keten_Delta))","v":""}]
[null,null,null,null,null,null,null,null,null,null,null,null,null,null,null,null,null,null,null,"Hier wordt detailinformatie weergegeven over de NL-ketenstappen "]
[]
[]
[]
[null,null,null,null,null,null,null,null,null,null,null,null,null,null,null,null,null,null,null,"Hier wordt detailinformatie weergegeven over de EU-ketenstappen "]
[null,null,"EU"]
[]
[null,null,null,null,null,null,null,null,null,null,null,null,null,null,null,null,null,null,null,"Hier wordt de gevraagde ketenstap weergegeven"]
[null,null,null,"Detailinformatie Stap:",null,null,null,null,1]
[]
[]
[null,null,null,null,null,null,null,null,null,null,"NL",null,"EU"]
[null,null,null,"Teelt",null,null,null,null,null,null,{"$f":"IF(Uit_NL_Keten_Totaal_CO2<1,IF(Uit_NL_Keten_Cultivatie_CO2<0.005,\"0,00\",TEXT(Uit_NL_Keten_Cultivatie_CO2,\"#.##0,00\")),\nIF(Uit_NL_Keten_Totaal_CO2<10,IF(Uit_NL_Keten_Cultivatie_CO2<0.05,\"0,0\",TEXT(Uit_NL_Keten_Cultivatie_CO2,\"#.##0,0\")),\nIF(Uit_NL_Keten_Totaal_CO2<50,IF(Uit_NL_Keten_Cultivatie_CO2<0.5,\"0\",TEXT(Uit_NL_Keten_Cultivatie_CO2,\"#.##\")),\nIF(Uit_NL_Keten_Cultivatie_CO2<0.5,\"0\",TEXT(Uit_NL_Keten_Cultivatie_CO2,\"#.##\")))))","v":"0,0"},null,{"$f":"IF(VLOOKUP(Hout_Keten_EU,Lijst_EU_Keten,Keten_Titel_NL_EU)=\"NL\",\"\",\nIF(Uit_EU_Keten_Totaal_CO2<1,IF(Uit_EU_Keten_Cultivatie_CO2<0.005,\"0,00\",TEXT(Uit_EU_Keten_Cultivatie_CO2,\"#.##0,00\")),\nIF(Uit_EU_Keten_Totaal_CO2<10,IF(Uit_EU_Keten_Cultivatie_CO2<0.05,\"0,0\",TEXT(Uit_EU_Keten_Cultivatie_CO2,\"#.##0,0\")),\nIF(Uit_EU_Keten_Totaal_CO2<50,IF(Uit_EU_Keten_Cultivatie_CO2<0.5,\"0\",TEXT(Uit_EU_Keten_Cultivatie_CO2,\"#.##\")),\nIF(Uit_EU_Keten_Cultivatie_CO2<0.5,\"0\",TEXT(Uit_EU_Keten_Cultivatie_CO2,\"#.##\"))))))","v":"0,0"},null,"gCO2eq/MJ",null,null,null,null,"CO2eq voor Teelt",null,null,null,null,null,null,null,null,null,null,"Eenhedenkeuze:",null,null,null,null,"gCO2eq/MJ - kgCO2eq - kgCO2eq/tonds - tonCO2eq - MtonCO2eq"]
[null,null,null,"Proces",null,null,null,null,null,null,{"$f":"IF(Uit_NL_Keten_Totaal_CO2<1,IF(Uit_NL_Keten_Proces_CO2<0.005,\"0,00\",TEXT(Uit_NL_Keten_Proces_CO2,\"#.##0,00\")),\nIF(Uit_NL_Keten_Totaal_CO2<10,IF(Uit_NL_Keten_Proces_CO2<0.05,\"0,0\",TEXT(Uit_NL_Keten_Proces_CO2,\"#.##0,0\")),\nIF(Uit_NL_Keten_Totaal_CO2<50,IF(Uit_NL_Keten_Proces_CO2<0.5,\"0\",TEXT(Uit_NL_Keten_Proces_CO2,\"#.##\")),\nIF(Uit_NL_Keten_Proces_CO2<0.5,\"0\",TEXT(Uit_NL_Keten_Proces_CO2,\"#.##\")))))","v":"1,5"},null,{"$f":"IF(VLOOKUP(Hout_Keten_EU,Lijst_EU_Keten,Keten_Titel_NL_EU)=\"NL\",\"\",\nIF(Uit_EU_Keten_Totaal_CO2<1,IF(Uit_EU_Keten_Proces_CO2<0.005,\"0,00\",TEXT(Uit_EU_Keten_Proces_CO2,\"#.##0,00\")),\nIF(Uit_EU_Keten_Totaal_CO2<10,IF(Uit_EU_Keten_Proces_CO2<0.05,\"0,0\",TEXT(Uit_EU_Keten_Proces_CO2,\"#.##0,0\")),\nIF(Uit_EU_Keten_Totaal_CO2<50,IF(Uit_EU_Keten_Proces_CO2<0.5,\"0\",TEXT(Uit_EU_Keten_Proces_CO2,\"#.##\")),\nIF(Uit_EU_Keten_Proces_CO2<0.5,\"0\",TEXT(Uit_EU_Keten_Proces_CO2,\"#.##\"))))))","v":"1,8"},null,{"$f":"O161","v":"gCO2eq/MJ"},null,null,null,null,"CO2eq voor Proces",null,null,null,null,null,null,null,null,null,null,"Eenhedenkeuze:",null,null,null,null,"Geen - Gelijk aan Teelt"]
[null,null,null,"Transport",null,null,null,null,null,null,{"$f":"IF(Uit_NL_Keten_Totaal_CO2<1,IF(Uit_NL_Keten_Transport_CO2<0.005,\"0,00\",TEXT(Uit_NL_Keten_Transport_CO2,\"#.##0,00\")),\nIF(Uit_NL_Keten_Totaal_CO2<10,IF(Uit_NL_Keten_Transport_CO2<0.05,\"0,0\",TEXT(Uit_NL_Keten_Transport_CO2,\"#.##0,0\")),\nIF(Uit_NL_Keten_Totaal_CO2<50,IF(Uit_NL_Keten_Transport_CO2<0.5,\"0\",TEXT(Uit_NL_Keten_Transport_CO2,\"#.##\")),\nIF(Uit_NL_Keten_Transport_CO2<0.5,\"0\",TEXT(Uit_NL_Keten_Transport_CO2,\"#.##\")))))","v":"0,9"},null,{"$f":"IF(VLOOKUP(Hout_Keten_EU,Lijst_EU_Keten,Keten_Titel_NL_EU)=\"NL\",\"\",\nIF(Uit_EU_Keten_Totaal_CO2<1,IF(Uit_EU_Keten_Transport_CO2<0.005,\"0,00\",TEXT(Uit_EU_Keten_Transport_CO2,\"#.##0,00\")),\nIF(Uit_EU_Keten_Totaal_CO2<10,IF(Uit_EU_Keten_Transport_CO2<0.05,\"0,0\",TEXT(Uit_EU_Keten_Transport_CO2,\"#.##0,0\")),\nIF(Uit_EU_Keten_Totaal_CO2<50,IF(Uit_EU_Keten_Transport_CO2<0.5,\"0\",TEXT(Uit_EU_Keten_Transport_CO2,\"#.##\")),\nIF(Uit_EU_Keten_Transport_CO2<0.5,\"0\",TEXT(Uit_EU_Keten_Transport_CO2,\"#.##\"))))))","v":"3,0"},null,{"$f":"O161","v":"gCO2eq/MJ"},null,null,null,null,"CO2eq voor Transport",null,null,null,null,null,null,null,null,null,null,"Eenhedenkeuze:",null,null,null,null,"Geen - Gelijk aan Teelt"]
[null,null,null,"Totaal",null,null,null,null,null,null,{"$f":"IF(Uit_NL_Keten_Totaal_CO2<1,IF(Uit_NL_Keten_Totaal_CO2<0.005,\"0,00\",TEXT(Uit_NL_Keten_Totaal_CO2,\"#.##0,00\")),\nIF(Uit_NL_Keten_Totaal_CO2<10,IF(Uit_NL_Keten_Totaal_CO2<0.05,\"0,0\",TEXT(Uit_NL_Keten_Totaal_CO2,\"#.##0,0\")),\nIF(Uit_NL_Keten_Totaal_CO2<50,IF(Uit_NL_Keten_Totaal_CO2<0.5,\"0\",TEXT(Uit_NL_Keten_Totaal_CO2,\"#.##\")),\nIF(Uit_NL_Keten_Totaal_CO2<0.5,\"0\",TEXT(Uit_NL_Keten_Totaal_CO2,\"#.##\")))))","v":"2,4"},null,{"$f":"IF(VLOOKUP(Hout_Keten_EU,Lijst_EU_Keten,Keten_Titel_NL_EU)=\"NL\",\"\",\nIF(Uit_EU_Keten_Totaal_CO2<1,IF(Uit_EU_Keten_Totaal_CO2<0.005,\"0,00\",TEXT(Uit_EU_Keten_Totaal_CO2,\"#.##0,00\")),\nIF(Uit_EU_Keten_Totaal_CO2<10,IF(Uit_EU_Keten_Totaal_CO2<0.05,\"0,0\",TEXT(Uit_EU_Keten_Totaal_CO2,\"#.##0,0\")),\nIF(Uit_EU_Keten_Totaal_CO2<50,IF(Uit_EU_Keten_Totaal_CO2<0.5,\"0\",TEXT(Uit_EU_Keten_Totaal_CO2,\"#.##\")),\nIF(Uit_EU_Keten_Totaal_CO2<0.5,\"0\",TEXT(Uit_EU_Keten_Totaal_CO2,\"#.##\"))))))","v":"4,8"},null,{"$f":"O161","v":"gCO2eq/MJ"},null,null,null,null,"CO2eq voor Totaal",null,null,null,null,null,null,null,null,null,null,"Eenhedenkeuze:",null,null,null,null,"Geen - Gelijk aan Teelt"]
[]
[]
[]
[null,null,null,"Proces",null,null,null,null,null,null,"CO2eq",{"$f":"IF(Samenvatting_Proces_CO2T<10,TEXT(Samenvatting_Proces_CO2T,\"#.##0,0\"),TEXT(Samenvatting_Proces_CO2T,\"#.##\"))","v":"47.924.767"},null,null,"gCO2eq",null,null,null,null,"Totale CO2eq emissie van het Proces.",null,null,null,null,null,null,null,null,null,null,"Eenhedenkeuze:",null,null,null,null,"gCO2eq - kgCO2eq - tonCO2eq - MtonCO2eq"]
[null,null,null,null,null,null,null,null,null,null,"Doorzet",{"$f":"IF(Samenvatting_Proces_Doorzet<10,TEXT(Samenvatting_Proces_Doorzet,\"#.##0,0\"),TEXT(Samenvatting_Proces_Doorzet,\"#.##\"))","v":"34.107.141"},null,null,"MJ",null,null,null,null,"Doorzet van biomassa door het Proces",null,null,null,null,null,null,null,null,null,null,"Eenhedenkeuze:",null,null,null,null,"m3 - kg - kgds - ton - tonds - MJ - GJ - kWh - MWh"]
[null,null,null,null,null,null,null,null,null,null,"CO2eq/Doorzet",{"$f":"IF(L168/L169<10,TEXT(L168/L169,\"#.##0,0\"),TEXT(L168/L169,\"#.##\"))","v":"1,4"},null,null,{"$f":"Samenvatting_Proces_CO2T_Dim&\"/\"&Samenvatting_Proces_Doorzet_Dim","v":"gCO2eq/MJ"},null,null,null,null,"Verhouding van CO2eq en Doorzet",null,null,null,null,null,null,null,null,null,null,"Eenhedenkeuze:",null,null,null,null,"Geen, waarde wordt berekend uit CO2eq en Doorzet"]
[]
[]
[null,null,null,"Opmerkingen:"]
[null,null,null,"Er wordt per keer zoveel gechipt als in de bunker past: 80/85 m3. Kosten 3 uur chipper 250 €/uur (veel kosten voor heen en weer rijden, vanwege kleine hoeveelheid).",null,null,null,null,null,null,null,null,null,null,null,null,null,null,null,"Opmerkingen vrij in te vullen"]
[]
[]
[]
[null,null,null,"Omschrijving",null,null,null,null,null,null,"Chippen",null,null,null,null,null,null,null,null,"Omschrijving van het Proces vrij in te vullen"]
[null,null,null,"Houtvorm proces",null,null,null,null,null,null,null,null,"Chips G50/P31,5",null,null,null,null,null,null,"Houtvorm ",null,null,null,null,null,null,null,null,null,null,"Keuze uit:",null,null,null,null,"Datalijst met Houtvorm"]
[null,null,null,"Verandering Houthoeveelheid",null,null,null,null,null,null,null,null,-2,null,null,"%",null,null,null,"Verandering, in de regel verlies van biomassa in het Proces. Massaverlies is negatief"]
[null,null,null,"Verandering Houtvochtigheid ",null,null,null,null,null,null,null,null,0,null,null,"%",null,null,null,"Verandering van de vochtigheid in het Proces. Bijvoorbeeld drogen - verandering is dan negatief. Materiaal wordt droger"]
[]
[]
[]
[]
[]
[]
[]
[]
[null,null,null,"Gebruik Brandstof",null,null,null,null,null,null,null,null,null,null,null,null,null,null,null,"Werktuig op basis van verbranding voor Proces vrij in te vullen"]
[null,null,null,"Werktuig",null,null,null,null,null,null,"Chipper",null,null,null,null,null,null,null,null,"Capaciteit vrij in te vullen",null,null,null,null,null,null,null,null,null,null,"Eenhedenkeuze:",null,null,null,null,"uur-m3/uur-ton/uur-tonds/uur-GJ/uur-MWh/uur-uur/m3-uur/ton-uur/tonds-uur/GJ-uur/MWh"]
[null,null,null,"Capaciteit werktuig",null,null,null,null,null,null,null,{"$f":"IF(OR(AND(Proces_Verbrandingsmotor_Inzet=\"\",Proces_Verbrandingsmotor_Ja_Nee=\"Ja\"),\nAND(Proces_Verbrandingsmotor_Inzet_Dim=\"\",Proces_Verbrandingsmotor_Ja_Nee=\"Ja\")),\"▼\",\"\")","v":""},50,null,null,"m3/uur",null,null,null,"Brandstof",null,null,null,null,null,null,null,null,null,null,"Keuze uit:",null,null,null,null,"Datalijst met Brandstoffen "]
[null,null,null,"Brandstof",null,null,null,null,null,null,null,{"$f":"IF(AND(Proces_Verbrandingsmotor_Brandstof=\"\",Proces_Verbrandingsmotor_Ja_Nee=\"Ja\"),\"▼\",\"\")","v":""},"EU-Diesel",null,null,null,null,null,null,"Euronorm en Categorie ",null,null,null,null,null,null,null,null,null,null,"Keuze uit:",null,null,null,null,"Euronorm Euro1 - Euro6,  "]
[null,null,null,"Euronorm/Categorie",null,null,null,null,null,null,null,null,"Euro 5",null,null,null,null,null,null,"Brandstofverbruik vrij in te vullen",null,null,null,null,null,null,null,null,null,null,"Eenhedenkeuze:",null,null,null,null,"liter - m3 - kg - ton - liter/uur - m3/uur - kg/uur - ton/uur"]
[null,null,null,"Brandstofverbruik",null,null,null,null,null,null,null,{"$f":"IF(OR(AND(Proces_Verbrandingsmotor_Verbruik=\"\",Proces_Verbrandingsmotor_Ja_Nee=\"Ja\"),\nAND(Proces_Verbrandingsmotor_Verbruik_Dim=\"\",Proces_Verbrandingsmotor_Ja_Nee=\"Ja\")),\"▼\",\"\")","v":""},50,null,null,"liter/uur"]
[]
[null,null,null,"Gebruik Elektriciteit",null,null,null,null,null,null,null,null,null,null,null,null,null,null,null,"Werktuig op basis van elektriciteit voor Proces vrij in te vullen"]
[null,null,null,"Werktuig",null,null,null,null,null,null,"Hulpaandrijving",null,null,null,null,null,null,null,null,"Keuze uit vermogen of verbruik",null,null,null,null,null,null,null,null,null,null,"Eenhedenkeuze:",null,null,null,null,"Vermogen: ",null,null,null,"kW - MW",null,null,null,null,"Verbruik:",null,null,"kWh - MWh - MJ - GJ"]
[null,null,null,null,"Verbruik",null,null,null,null,null,null,{"$f":"IF(OR(AND(Proces_Elektromotor_VermogenVerbruik=\"\",Proces_Elektromotor_Ja_Nee=\"Ja\"),\nAND(Proces_Elektromotor_VermogenVerbruik_Dim=\"\",Proces_Elektromotor_Ja_Nee=\"Ja\")),\"▼\",\"\")","v":""},2500,null,null,"kWh",null,null,null,"Stroombron",null,null,null,null,null,null,null,null,null,null,"Keuze uit:",null,null,null,null,"Datalijst met Stroombronnen"]
[null,null,null,"Stroombron",null,null,null,null,null,{"$f":"IF(AND(Proces_Elektromotor_Stroombron=\"\",Proces_Elektromotor_Ja_Nee=\"Ja\"),\"▼\",\"\")","v":""},"EU-Elektriciteit NL",null,null,null,null,null,null,null,null,"Loadfactor (=mate belasting van het agregaat) vrij in te vullen",null,null,null,null,null,null,null,null,null,null,null,null,null,null,null,"Eenheid = %"]
[null,null,null,"n.v.T.",null,null,null,null,null,null,null,{"$f":"IF(AND(Proces_Elektromotor_Loadfactor=\"\",Proces_Elektromotor_Ja_Nee=\"Ja\",Proces_Elektromotor_Vermogen_Verbruik=\"Vermogen\"),\"▼\",\"\")","v":""},null,null,null,null,null,null,null,"Capaciteit vrij in te vullen",null,null,null,null,null,null,null,null,null,null,"Eenhedenkeuze:",null,null,null,null,"m3/uur  - ton/uur -  tonds/uur - GJ/uu r- "]
[null,null,null,"n.v.t.",null,null,null,null,null,null,null,{"$f":"IF(OR(AND(Proces_Elektromotor_Capaciteit=\"\",Proces_Elektromotor_Ja_Nee=\"Ja\",Proces_Elektromotor_Vermogen_Verbruik=\"Vermogen\"),\nAND(Proces_Elektromotor_Capaciteit_Dim=\"\",Proces_Elektromotor_Ja_Nee=\"Ja\",Proces_Elektromotor_Vermogen_Verbruik=\"Vermogen\")),\"▼\",\"\")","v":""},50,null,null,"m3/uur"]
[]
[null,null,null,null,null,null,null,null,null,null,null,null,null,null,null,null,null,null,null,"Basis CO2 productie vrij in te vullen ",null,null,null,null,null,null,null,null,null,null,"Eenhedenkeuze:",null,null,null,null,"gCO2eq/MJ - gCO2eq - kgCO2eq - tonCO2eq"]
[null,null,null,"Basis CO2 productie",null,null,null,null,null,null,null,null,10000,null,null,"kgCO2eq"]
[]
[]
[null,null,null,null,null,null,null,null,null,null,{"$f":"IF(Uit_Proces_Invoer_Uitvoer_Dim=\"Uitvoer\",\"\",\"Let op CO2/MJ is op invoer\")","v":""}]
[null,null,null,null,"CO2 gebaseerd op:",null,null,null,null,null,"Uitvoer",null,null,{"$f":"IF(Uit_Proces_Invoer_Uitvoer_Dim=\"Invoer\",\"van Hout\",\"naar Transport\")","v":"naar Transport"},null,null,null,null,null,"Modus voor berekening CO2eq",null,null,null,null,null,null,null,null,null,null,"Eenhedenkeuze:",null,null,null,null,"invoer - uitvoer"]
[null,null,null,null,"CO2 Verbrandingsmotor",null,null,null,null,null,{"$f":"IF(Uit_Proces_CO2T<1,IF(Uit_Proces_Brandstof_CO2<0.005,\"0,00\",TEXT(Uit_Proces_Brandstof_CO2,\"#.##0,00\")),\nIF(Uit_Proces_CO2T<10,IF(Uit_Proces_Brandstof_CO2<0.05,\"0,0\",TEXT(Uit_Proces_Brandstof_CO2,\"#.##0,0\")),\nIF(Uit_Proces_CO2T<50,IF(Uit_Proces_Brandstof_CO2<0.5,\"0\",TEXT(Uit_Proces_Brandstof_CO2,\"#.##\")),\nIF(Uit_Proces_Brandstof_CO2<0.5,\"0\",TEXT(Uit_Proces_Brandstof_CO2,\"#.##\")))))","v":"1,1"},null,null,"gCO2eq/MJ",null,null,null,null,null,"CO2eq voor brandstofverbruik",null,null,null,null,null,null,null,null,null,null,"Eenhedenkeuze:",null,null,null,null,"gCO2eq/MJ - gCO2 - kgCO2 - tonCO2"]
[null,null,null,null,"CO2 Elektromotor",null,null,null,null,null,{"$f":"IF(Uit_Proces_CO2T<1,IF(Uit_Proces_Stroom_CO2<0.005,\"0,00\",TEXT(Uit_Proces_Stroom_CO2,\"#.##0,00\")),\nIF(Uit_Proces_CO2T<10,IF(Uit_Proces_Stroom_CO2<0.05,\"0,0\",TEXT(Uit_Proces_Stroom_CO2,\"#.##0,0\")),\nIF(Uit_Proces_CO2T<50,IF(Uit_Proces_Stroom_CO2<0.5,\"0\",TEXT(Uit_Proces_Stroom_CO2,\"#.##\")),\nIF(Uit_Proces_Stroom_CO2<0.5,\"0\",TEXT(Uit_Proces_Stroom_CO2,\"#.##\")))))","v":"0,0"},null,null,{"$f":"Uit_Proces_Verbrandingsmotor_CO2_Dim","v":"gCO2eq/MJ"},null,null,null,null,null,"CO2eq voor elektriciteitsverbruik",null,null,null,null,null,null,null,null,null,null,"Eenhedenkeuze:",null,null,null,null,"Geen - Gelijk aan Brandstof"]
[null,null,null,null,"CO2 Basis",null,null,null,null,null,{"$f":"IF(Uit_Proces_CO2T<1,IF(Uit_Proces_Basis_CO2<0.005,\"0,00\",TEXT(Uit_Proces_Basis_CO2,\"#.##0,00\")),\nIF(Uit_Proces_CO2T<10,IF(Uit_Proces_Basis_CO2<0.05,\"0,0\",TEXT(Uit_Proces_Basis_CO2,\"#.##0,0\")),\nIF(Uit_Proces_CO2T<50,IF(Uit_Proces_Basis_CO2<0.5,\"0\",TEXT(Uit_Proces_Basis_CO2,\"#.##\")),\nIF(Uit_Proces_Basis_CO2<0.5,\"0\",TEXT(Uit_Proces_Basis_CO2,\"#.##\")))))","v":"0,3"},null,null,{"$f":"Uit_Proces_Verbrandingsmotor_CO2_Dim","v":"gCO2eq/MJ"},null,null,null,null,null,"CO2eq voor basis",null,null,null,null,null,null,null,null,null,null,"Eenhedenkeuze:",null,null,null,null,"Geen - Gelijk aan Brandstof"]
[null,null,null,null,"CO2 Totaal",null,null,null,null,null,{"$f":"IF(Uit_Proces_CO2T<1,IF(Uit_Proces_CO2T<0.005,\"0,00\",TEXT(Uit_Proces_CO2T,\"#.##0,00\")),\nIF(Uit_Proces_CO2T<10,IF(Uit_Proces_CO2T<0.05,\"0,0\",TEXT(Uit_Proces_CO2T,\"#.##0,0\")),\nIF(Uit_Proces_CO2T<50,IF(Uit_Proces_CO2T<0.5,\"0\",TEXT(Uit_Proces_CO2T,\"#.##\")),\nIF(Uit_Proces_CO2T<0.5,\"0\",TEXT(Uit_Proces_CO2T,\"#.##\")))))","v":"1,4"},null,null,{"$f":"Uit_Proces_Verbrandingsmotor_CO2_Dim","v":"gCO2eq/MJ"},null,null,null,null,null,"CO2eq voor totaal Proces",null,null,null,null,null,null,null,null,null,null,"Eenhedenkeuze:",null,null,null,null,"Geen - Gelijk aan Brandstof"]
[]
[]
[]
[null,null,null,"Transport",null,null,null,null,null,null,"CO2eq",{"$f":"IF(Samenvatting_Transport_CO2T<10,TEXT(Samenvatting_Transport_CO2T,\"#.##0,0\"),TEXT(Samenvatting_Transport_CO2T,\"#.##\"))","v":"10.360.419"},null,null,"gCO2eq",null,null,null,null,"Totale CO2eq emissie van het Transport.",null,null,null,null,null,null,null,null,null,null,"Eenhedenkeuze:",null,null,null,null,"gCO2eq - kgCO2eq - tonCO2eq - MtonCO2eq"]
[null,null,null,null,null,null,null,null,null,null,"Doorzet",{"$f":"IF(Samenvatting_Transport_Doorzet<10,TEXT(Samenvatting_Transport_Doorzet,\"#.##0,0\"),TEXT(Samenvatting_Transport_Doorzet,\"#.##\"))","v":"34.107.141"},null,null,"MJ",null,null,null,null,"Doorzet van biomassa door het Transport",null,null,null,null,null,null,null,null,null,null,"Eenhedenkeuze:",null,null,null,null,"m3 - kg - kgds - ton - tonds - MJ - GJ - kWh - MWh"]
[null,null,null,null,null,null,null,null,null,null,"CO2eq/Doorzet",{"$f":"IF(L217/L218<10,TEXT(L217/L218,\"#.##0,0\"),TEXT(L217/L218,\"#.##\"))","v":"0,3"},null,null,{"$f":"Samenvatting_Transport_CO2T_Dim&\"/\"&Samenvatting_Transport_Doorzet_Dim","v":"gCO2eq/MJ"},null,null,null,null,"Verhouding van CO2eq en Doorzet",null,null,null,null,null,null,null,null,null,null,"Eenhedenkeuze:",null,null,null,null,"Geen, waarde wordt berekend uit CO2eq en Doorzet"]
[]
[]
[null,null,null,"Opmerkingen:"]
[null,null,null,"Vrachtwagens komen leeg terug",null,null,null,null,null,null,null,null,null,null,null,null,null,null,null,"Opmerkingen vrij in te vullen"]
[]
[]
[]
[null,null,null,"Omschrijving",null,null,null,null,null,null,"Transport naar afnemer",null,null,null,null,null,null,null,null,"Omschrijving van het Transport vrij in te vullen"]
[null,null,null,"Houtvorm",null,null,null,null,null,null,null,null,{"$f":"Proces_Vorm","v":"Chips G50/P31,5"},null,null,null,null,null,null,"Houtvorm ",null,null,null,null,null,null,null,null,null,null,"Keuze uit:",null,null,null,null,"Datalijst met Houtvorm"]
[null,null,null,"Verandering Houthoeveelheid",null,null,null,null,null,null,null,null,0,null,null,"%",null,null,null,"Verandering, in de regel verlies van biomassa in het Transport. Massaverlies is negatief"]
[null,null,null,"Verandering Houtvochtigheid ",null,null,null,null,null,null,null,null,0,null,null,"%",null,null,null,"Verandering van de vochtigheid in het Transport. Bijvoorbeeld drogen - verandering is dan negatief"]
[]
[null,null,null,"Afstand - enkele reis",null,null,null,null,null,null,null,null,50,null,null,"km",null,null,null,"Reisafstand",null,null,null,null,null,null,null,null,null,null,"Eenhedenkeuze:",null,null,null,null,"vaste waarde: km"]
[null,null,null,"Laadruimte",null,null,null,null,null,null,null,null,90,null,null,"m3",null,null,null,"Laadruimte van het transportmiddel",null,null,null,null,null,null,null,null,null,null,"Eenhedenkeuze:",null,null,null,null,"vaste waarde: m3"]
[null,null,null,"Laadvermogen",null,null,null,null,null,null,null,null,25,null,null,"ton",null,null,null,"Laadvermogen van het transportmiddel",null,null,null,null,null,null,null,null,null,null,"Eenhedenkeuze:",null,null,null,null,"vaste waarde: ton"]
[null,null,null,"Belading heen",null,null,null,null,null,null,null,null,100,null,null,"%",null,null,null,"Belading heen",null,null,null,null,null,null,null,null,null,null,"Eenhedenkeuze:",null,null,null,null,"vaste waarde: %"]
[null,null,null,"Belading terug",null,null,null,null,null,null,null,null,50,null,null,"%",null,null,null,"Belading terug",null,null,null,null,null,null,null,null,null,null,"Eenhedenkeuze:",null,null,null,null,"vaste waarde: %"]
[null,null,null,"Snelheid",null,null,null,null,null,null,null,null,55,null,null,"km/uur",null,null,null,"Snelheid",null,null,null,null,null,null,null,null,null,null,"Eenhedenkeuze:",null,null,null,null,"vaste waarde: km/uur"]
[]
[null,null,null,"Gebruik Brandstof"]
[null,null,null,"Werktuig",null,null,null,null,null,null,"Vrachtauto DAF 250",null,null,null,null,null,null,null,null,"Werktuig op basis van verbranding voor Transport vrij in te vullen"]
[null,null,null,"Brandstof",null,null,null,null,null,null,null,{"$f":"IF(AND(Transport_Verbrandingsmotor_Brandstof=\"\",Transport_Verbrandingsmotor_ID=1),\"▼\",\"\")","v":""},"EU-Diesel",null,null,null,null,null,null,"Brandstof",null,null,null,null,null,null,null,null,null,null,"Keuze uit:",null,null,null,null,"Datalijst met Brandstoffen "]
[null,null,null,"Euronorm/Categorie",null,null,null,null,null,null,null,null,"Euro 6",null,null,null,null,null,null,"Euronorm en Categorie ",null,null,null,null,null,null,null,null,null,null,"Keuze uit:",null,null,null,null,"Euronorm Euro1 - Euro6,  "]
[null,null,null,"Brandstofverbruik",null,null,null,null,null,null,null,{"$f":"IF(OR(AND(Transport_Verbrandingsmotor_Verbruik=\"\",Transport_Verbrandingsmotor_ID=1),\nAND(Transport_Verbrandingsmotor_Verbruik_Dim=\"\",Transport_Verbrandingsmotor_ID=1)),\"▼\",\"\")","v":""},30,null,null,"liter/100km",null,null,null,"Brandstofverbruik vrij in te vullen",null,null,null,null,null,null,null,null,null,null,"Eenhedenkeuze:",null,null,null,null,"liter - liter/km - liter/100km - kg - kg/km - kg/100km"]
[]
[]
[null,null,null,"Gebruik Elektriciteit"]
[null,null,null,"n.v.t.",null,null,null,null,null,null,null,null,null,null,null,null,null,null,null,"Werktuig op basis vanelektriciteit voor Transport vrij in te vullen"]
[null,null,null,null,"n.v.t.",null,null,null,null,null,null,{"$f":"IF(OR(AND(Transport_Elektromotor_VermogenVerbruik=\"\",Transport_Elektromotor_Ja_Nee=\"Ja\"),\nAND(Transport_Elektromotor_VermogenVerbruik_Dim=\"\",Transport_Elektromotor_Ja_Nee=\"Ja\")),\"▼\",\"\")","v":""},null,null,null,null,null,null,null,"Keuze uit vermogen of verbruik",null,null,null,null,null,null,null,null,null,null,"Eenhedenkeuze:",null,null,null,null,"Vermogen: ",null,null,null,"kW - MW",null,null,null,null,"Verbruik:",null,null,"kWh - MWh - MJ - GJ"]
[null,null,null,"n.v.t.",null,null,null,null,null,{"$f":"IF(AND(Transport_Elektromotor_Stroombron=\"\",Transport_Elektromotor_Ja_Nee=\"Ja\"),\"▼\",\"\")","v":""},null,null,null,null,null,null,null,null,null,"Stroombron",null,null,null,null,null,null,null,null,null,null,"Keuze uit:",null,null,null,null,"Datalijst met Stroombronnen"]
[null,null,null,"Loadfactor",null,null,null,null,null,null,null,{"$f":"IF(AND(Transport_Elektromotor_Loadfactor=\"\",Transport_Elektromotor_Ja_Nee=\"Ja\",Transport_Elektromotor_Vermogen_Verbruik=\"Vermogen\"),\"▼\",\"\")","v":""},null,null,null,"%",null,null,null,"Loadfactor (=mate belasting van het agregaat) vrij in te vullen",null,null,null,null,null,null,null,null,null,null,null,null,null,null,null,"Eenheid = %"]
[]
[]
[]
[null,null,null,"Basis CO2 productie",null,null,null,null,null,null,null,null,0,null,null,"gCO2eq/tkm",null,null,null,"Basis CO2 productie vrij in te vullen ",null,null,null,null,null,null,null,null,null,null,"Eenhedenkeuze:",null,null,null,null,"gCO2eq/MJ - gCO2eq - kgCO2eq - tonCO2eq"]
[]
[]
[null,null,null,null,null,null,null,null,null,null,{"$f":"IF(Uit_Transport_Invoer_Uitvoer_Dim=\"Uitvoer\",\"\",\"Let op CO2/MJ is op invoer\")","v":""}]
[null,null,null,null,"CO2 gebaseerd op:",null,null,null,null,null,"Uitvoer",null,null,{"$f":"IF(Uit_Transport_Invoer_Uitvoer_Dim=\"Invoer\",\"van Proces\",\"naar eindgebruiker\")","v":"naar eindgebruiker"},null,null,null,null,null,"Modus voor berekening CO2eq",null,null,null,null,null,null,null,null,null,null,"Eenhedenkeuze:",null,null,null,null,"invoer - uitvoer"]
[null,null,null,null,"CO2 Verbranding",null,null,null,null,null,{"$f":"IF(Uit_Transport_CO2T<1,IF(Uit_Transport_Brandstof_CO2<0.005,\"0,00\",TEXT(Uit_Transport_Brandstof_CO2,\"#.##0,00\")),\nIF(Uit_Transport_CO2T<10,IF(Uit_Transport_Brandstof_CO2<0.05,\"0,0\",TEXT(Uit_Transport_Brandstof_CO2,\"#.##0,0\")),\nIF(Uit_Transport_CO2T<50,IF(Uit_Transport_Brandstof_CO2<0.5,\"0\",TEXT(Uit_Transport_Brandstof_CO2,\"#.##\")),\nIF(Uit_Transport_Brandstof_CO2<0.5,\"0\",TEXT(Uit_Transport_Brandstof_CO2,\"#.##\")))))","v":"0,30"},null,null,"gCO2eq/MJ",null,null,null,null,null,"CO2eq voor brandstofverbruik",null,null,null,null,null,null,null,null,null,null,"Eenhedenkeuze:",null,null,null,null,"gCO2eq/MJ - gCO2eq/tkm - kgCO2eq - kgCO2eq/tonds - tonCO2eq - MtonCO2eq"]
[null,null,null,null,"CO2 Elektromotor",null,null,null,null,null,{"$f":"IF(Uit_Transport_CO2T<1,IF(Uit_Transport_Stroom_CO2<0.005,\"0,00\",TEXT(Uit_Transport_Stroom_CO2,\"#.##0,00\")),\nIF(Uit_Transport_CO2T<10,IF(Uit_Transport_Stroom_CO2<0.05,\"0,0\",TEXT(Uit_Transport_Stroom_CO2,\"#.##0,0\")),\nIF(Uit_Transport_CO2T<50,IF(Uit_Transport_Stroom_CO2<0.5,\"0\",TEXT(Uit_Transport_Stroom_CO2,\"#.##\")),\nIF(Uit_Transport_Stroom_CO2<0.5,\"0\",TEXT(Uit_Transport_Stroom_CO2,\"#.##\")))))","v":"0,00"},null,null,{"$f":"Uit_Transport_Verbrandingsmotor_CO2_Dim","v":"gCO2eq/MJ"},null,null,null,null,null,"CO2eq voor elektriciteitsverbruik",null,null,null,null,null,null,null,null,null,null,"Eenhedenkeuze:",null,null,null,null,"Geen - Gelijk aan Brandstof"]
[null,null,null,null,"CO2 Basis",null,null,null,null,null,{"$f":"IF(Uit_Transport_CO2T<1,IF(Uit_Transport_Basis_CO2<0.005,\"0,00\",TEXT(Uit_Transport_Basis_CO2,\"#.##0,00\")),\nIF(Uit_Transport_CO2T<10,IF(Uit_Transport_Basis_CO2<0.05,\"0,0\",TEXT(Uit_Transport_Basis_CO2,\"#.##0,0\")),\nIF(Uit_Transport_CO2T<50,IF(Uit_Transport_Basis_CO2<0.5,\"0\",TEXT(Uit_Transport_Basis_CO2,\"#.##\")),\nIF(Uit_Transport_Basis_CO2<0.5,\"0\",TEXT(Uit_Transport_Basis_CO2,\"#.##\")))))","v":"0,00"},null,null,{"$f":"Uit_Transport_Verbrandingsmotor_CO2_Dim","v":"gCO2eq/MJ"},null,null,null,null,null,"CO2eq voor basis",null,null,null,null,null,null,null,null,null,null,"Eenhedenkeuze:",null,null,null,null,"Geen - Gelijk aan Brandstof"]
[null,null,null,null,"CO2 Totaal",null,null,null,null,null,{"$f":"IF(Uit_Transport_CO2T<1,IF(Uit_Transport_CO2T<0.005,\"0,00\",TEXT(Uit_Transport_CO2T,\"#.##0,00\")),\nIF(Uit_Transport_CO2T<10,IF(Uit_Transport_CO2T<0.05,\"0,0\",TEXT(Uit_Transport_CO2T,\"#.##0,0\")),\nIF(Uit_Transport_CO2T<50,IF(Uit_Transport_CO2T<0.5,\"0\",TEXT(Uit_Transport_CO2T,\"#.##\")),\nIF(Uit_Transport_CO2T<0.5,\"0\",TEXT(Uit_Transport_CO2T,\"#.##\")))))","v":"0,30"},null,null,{"$f":"Uit_Transport_Verbrandingsmotor_CO2_Dim","v":"gCO2eq/MJ"},null,null,null,null,null,"CO2eq voor totaal Transport",null,null,null,null,null,null,null,null,null,null,"Eenhedenkeuze:",null,null,null,null,"Geen - Gelijk aan Brandstof"]

{"sheet":"E-Land-CO2","index":4,"n_rows":66,"n_cols":90,"rows_kept":66,"cut":false,"hidden":false,"merged":[[3,14,3,16],[4,14,4,16],[26,3,26,5],[26,10,26,11],[26,12,26,13],[34,44,34,46],[3,12,3,13],[3,10,3,11],[4,10,4,11],[4,12,4,13],[5,10,5,11],[5,12,5,13],[9,3,11,16],[30,10,30,11],[31,10,31,11],[30,3,30,9],[27,3,27,9],[31,3,31,9],[29,10,29,11],[17,15,17,16],[33,19,33,22],[30,14,30,16],[31,14,31,16],[34,12,34,13],[17,77,17,79],[18,77,18,79],[28,60,28,66],[26,60,26,66],[20,62,20,64],[27,31,27,32],[27,28,27,30],[26,26,26,32],[34,47,34,48],[34,31,34,32],[25,62,25,64],[33,26,33,32],[31,12,31,13],[32,12,32,13],[28,28,28,32],[27,14,27,16],[18,44,18,46],[32,35,32,43],[29,14,29,16],[32,14,32,16],[21,44,21,46],[33,35,33,38],[33,42,33,48],[32,3,32,9],[17,12,17,14],[27,44,27,48],[28,44,28,46],[25,6,25,16],[23,44,23,46],[30,28,30,30],[29,28,29,30],[29,44,29,46],[24,3,24,5],[32,10,32,11],[64,42,64,44],[13,42,13,48],[48,12,48,13],[48,14,48,16],[24,6,24,16],[27,12,27,13],[45,42,45,44],[62,45,62,46],[48,42,48,44],[61,26,61,28],[61,29,61,30],[28,12,28,13],[29,12,29,13],[30,12,30,13],[29,47,29,48],[47,12,47,13],[61,45,61,46],[28,10,28,11],[30,31,30,32],[25,35,25,43],[18,35,18,43],[27,10,27,11],[13,7,13,16],[19,3,19,8],[47,10,47,11],[48,10,48,11],[37,28,37,30],[46,26,46,28],[34,28,34,30],[45,14,45,16],[53,26,53,32],[62,42,62,44],[40,44,40,46],[37,31,37,32],[40,31,40,32],[46,10,46,11],[44,10,44,11],[44,12,44,13],[45,12,45,13],[46,12,46,13],[36,44,36,46],[44,42,44,44],[40,28,40,30],[45,45,45,47],[40,47,40,48],[36,28,36,30],[54,58,54,60],[59,10,59,12],[58,10,58,12],[62,13,62,14],[44,26,44,28],[35,42,35,48],[35,26,35,32],[46,14,46,16],[37,19,37,22],[35,19,35,22],[47,42,47,44],[46,42,46,44],[47,26,47,28],[45,26,45,28],[45,29,45,32],[45,10,45,11],[55,26,55,28],[59,26,59,28],[60,26,60,28],[60,29,60,30],[56,29,56,30],[57,26,57,28],[57,29,57,30],[56,26,56,28],[65,42,65,44],[48,26,48,28],[63,26,63,28],[65,26,65,28],[54,26,54,32],[53,42,53,48],[54,42,54,48],[55,42,55,44],[56,42,56,44],[56,45,56,46],[58,42,58,44],[59,42,59,44],[60,42,60,44],[60,45,60,46],[61,42,61,44],[63,45,63,46],[58,26,58,28],[57,42,57,44],[57,45,57,46],[64,26,64,28],[63,42,63,44],[62,26,62,28],[62,29,62,30],[63,29,63,30],[14,10,14,16],[15,10,15,16],[16,12,16,14],[66,10,66,12],[62,10,62,12],[63,10,63,12],[65,10,65,12],[56,10,56,12],[64,10,64,12],[55,10,55,12],[53,10,53,16],[28,14,28,16],[34,14,34,16],[18,12,18,14],[17,6,17,10],[63,13,63,14],[60,10,60,12],[60,13,60,14],[61,10,61,12],[61,13,61,14],[54,10,54,16],[34,10,34,11],[28,3,28,9],[29,3,29,9],[14,71,14,76],[13,71,13,76],[13,60,13,66],[14,60,14,66],[23,62,23,64],[13,35,13,41],[15,62,15,64],[17,62,17,64],[17,65,17,66],[21,60,21,62],[15,44,15,46],[16,28,16,30],[14,28,14,32],[14,44,14,48],[16,44,16,46],[17,28,17,30],[26,35,26,38],[9,53,11,66],[3,61,3,63],[3,64,3,66],[4,61,4,63],[4,64,4,66],[5,61,5,63],[5,64,5,66],[16,62,16,64],[15,28,15,30],[22,44,22,46],[19,44,19,46],[13,19,13,22],[13,26,13,32],[3,19,4,22],[9,19,11,32],[3,35,4,39],[3,43,3,45],[4,27,4,29],[4,43,4,45],[5,27,5,29],[5,43,5,45],[3,27,3,29],[3,30,3,32],[4,30,4,32],[5,30,5,32],[9,35,11,48],[9,71,11,84],[3,70,4,85],[27,65,27,66],[29,62,29,64],[29,65,29,66],[25,65,25,66],[16,77,16,79],[13,80,13,84],[3,46,3,48],[4,46,4,48],[5,46,5,48],[17,83,17,84],[14,80,14,82],[15,80,15,82],[16,80,16,82],[17,80,17,82],[18,80,18,82],[26,42,26,48],[18,47,18,48],[20,44,20,46],[20,47,20,48],[3,53,4,57],[19,83,19,84],[18,83,18,84],[55,68,55,73],[55,74,55,75],[55,78,55,80],[54,76,54,77],[19,77,19,79],[53,78,53,80],[27,62,27,64],[32,61,32,63],[32,64,32,66],[33,61,33,63],[34,61,34,63],[53,68,53,73],[54,68,54,73],[53,74,53,75],[54,74,54,75],[19,80,19,82],[54,78,54,80],[53,76,53,77],[54,61,54,62]]}
["Inhoud",null,1,{"$f":"C1+1","v":2},{"$f":"D1+1","v":3},4,5,6,7,8,9,10,11,12,13,14,15,16,1,{"$f":"S1+1","v":2},{"$f":"T1+1","v":3},4,5,6,7,8,9,10,11,12,13,14,15,16,1,{"$f":"AI1+1","v":2},{"$f":"AJ1+1","v":3},4,5,6,7,8,9,10,11,12,13,14,15,16]
[]
[null,null,null,null,null,null,null,null,null,null,null,"NL",null,"EU",null,null,null,null,null,null,null,null,null,null,null,null,null,null,null,null,null,null,null,null,null,null,null,null,null,null,null,null,null,null,null,null,null,null,null,null,null,null,1,{"$f":"BA3+1","v":2},{"$f":"BB3+1","v":3},4,5,6,7,8,9,10,11,12,13,14,15,16,null,null,1,{"$f":"BS3+1","v":2},{"$f":"BT3+1","v":3},4,5,6,7,8,9,10,11,12,13,14,15,16]
[null,null,null,null,null,null,null,null,null,"CO2eq",{"$f":"IF(Samenvatting_NL_Keten_CO2<10,TEXT(Samenvatting_NL_Keten_CO2,\"#.##0,0\"),TEXT(Samenvatting_NL_Keten_CO2,\"#.##\"))","v":"82.037"},null,{"$f":"IF(VLOOKUP(Hout_Keten_EU,Lijst_EU_Keten,Keten_Titel_NL_EU)=\"NL\",\"\",\nIF(Samenvatting_EU_Keten_CO2<10,TEXT(Samenvatting_EU_Keten_CO2,\"#.##0,0\"),TEXT(Samenvatting_EU_Keten_CO2,\"#.##\")))","v":"165.106"},null,"kgCO2eq",null,null,null,null,"Proces",null,null,null,null,null,null,"CO2eq",{"$f":"IF(Samenvatting_Proces_CO2T<10,TEXT(Samenvatting_Proces_CO2T,\"#.##0,0\"),TEXT(Samenvatting_Proces_CO2T,\"#.##\"))","v":"47.924.767"},null,null,"gCO2eq",null,null,null,null,"Transport",null,null,null,null,null,null,"CO2eq",{"$f":"IF(Samenvatting_Transport_CO2T<10,TEXT(Samenvatting_Transport_CO2T,\"#.##0,0\"),TEXT(Samenvatting_Transport_CO2T,\"#.##\"))","v":"10.360.419"},null,null,"gCO2eq",null,null,null,null,null,null,"Hulp",null,null,null,null,null,null,"CO2eq",{"$f":"IF(Samenvatting_Transport_CO2T<10,TEXT(Samenvatting_Transport_CO2T,\"#.##0,0\"),TEXT(Samenvatting_Transport_CO2T,\"#.##\"))","v":"10.360.419"},null,null,"gCO2eq",null,null,null,null,null,"Hulp - fossiel vergelijk"]
[null,null,null,null,null,null,null,null,null,"Doorzet",{"$f":"IF(Samenvatting_Hout_Doorzet<10,TEXT(Samenvatting_Hout_Doorzet,\"#.##0,0\"),TEXT(Samenvatting_Hout_Doorzet,\"#.##\"))","v":"1.803"},null,{"$f":"IF(VLOOKUP(Hout_Keten_EU,Lijst_EU_Keten,Keten_Titel_NL_EU)=\"NL\",\"\",\nIF(Samenvatting_Hout_Doorzet<10,TEXT(Samenvatting_Hout_Doorzet,\"#.##0,0\"),TEXT(Samenvatting_Hout_Doorzet,\"#.##\")))","v":"1.803"},null,"tonds",null,null,null,null,null,null,null,null,null,null,null,"Doorzet",{"$f":"IF(Samenvatting_Proces_Doorzet<10,TEXT(Samenvatting_Proces_Doorzet,\"#.##0,0\"),TEXT(Samenvatting_Proces_Doorzet,\"#.##\"))","v":"34.107.141"},null,null,"MJ",null,null,null,null,null,null,null,null,null,null,null,"Doorzet",{"$f":"IF(Samenvatting_Transport_Doorzet<10,TEXT(Samenvatting_Transport_Doorzet,\"#.##0,0\"),TEXT(Samenvatting_Transport_Doorzet,\"#.##\"))","v":"34.107.141"},null,null,"MJ",null,null,null,null,null,null,null,null,null,null,null,null,null,"Doorzet",{"$f":"IF(Samenvatting_Drogen_Doorzet<10,TEXT(Samenvatting_Drogen_Doorzet,\"#.##0,0\"),TEXT(Samenvatting_Drogen_Doorzet,\"#.##\"))","v":"31.006.492"},null,null,"MJ"]
[null,null,null,null,null,null,null,null,null,"CO2eq/Doorzet",{"$f":"IF(K4/K5<10,TEXT(K4/K5,\"#.##0,0\"),TEXT(K4/K5,\"#.##\"))","v":"46"},null,{"$f":"IF(VLOOKUP(Hout_Keten_EU,Lijst_EU_Keten,Keten_Titel_NL_EU)=\"NL\",\"\",\nIF(M4/M5<10,TEXT(M4/M5,\"#.##0,0\"),TEXT(M4/M5,\"#.##\")))","v":"92"},null,{"$f":"Samenvatting_Hout_CO2T_Dim&\"/\"&Samenvatting_Hout_Doorzet_Dim","v":"kgCO2eq/tonds"},null,null,null,null,null,null,null,null,null,null,null,"CO2eq/Doorzet",{"$f":"IF(AB4/AB5<10,TEXT(AB4/AB5,\"#.##0,0\"),TEXT(AB4/AB5,\"#.##\"))","v":"1,4"},null,null,{"$f":"Samenvatting_Proces_CO2T_Dim&\"/\"&Samenvatting_Proces_Doorzet_Dim","v":"gCO2eq/MJ"},null,null,null,null,null,null,null,null,null,null,null,"CO2eq/Doorzet",{"$f":"IF(AR4/AR5<10,TEXT(AR4/AR5,\"#.##0,0\"),TEXT(AR4/AR5,\"#.##\"))","v":"0,3"},null,null,{"$f":"Samenvatting_Transport_CO2T_Dim&\"/\"&Samenvatting_Transport_Doorzet_Dim","v":"gCO2eq/MJ"},null,null,null,null,null,null,null,null,null,null,null,null,null,"CO2eq/Doorzet",{"$f":"IF(BJ4/BJ5<10,TEXT(BJ4/BJ5,\"#.##0,0\"),TEXT(BJ4/BJ5,\"#.##\"))","v":"0,3"},null,null,{"$f":"Samenvatting_Drogen_CO2_Dim&\"/\"&Samenvatting_Drogen_Doorzet_Dim","v":"gCO2eq/MJ"}]
[null,null,"©KandT/Zilverberg"]
[]
[null,null,null,"Opmerkingen:",null,null,null,null,null,null,null,null,null,null,null,null,null,null,null,"Opmerkingen:",null,null,null,null,null,null,null,null,null,null,null,null,null,null,null,"Opmerkingen:"]
[null,null,null,null,null,null,null,null,null,null,null,null,null,null,null,null,null,null,null,"Er wordt per keer zoveel gechipt als in de bunker past: 80/85 m3. Kosten 3 uur chipper 250 €/uur (veel kosten voor heen en weer rijden, vanwege kleine hoeveelheid).",null,null,null,null,null,null,null,null,null,null,null,null,null,null,null,"Vrachtwagens komen leeg terug",null,null,null,null,null,null,null,null,null,null,null,null,null,null,null,null,null,"Droogproces",null,null,null,null,null,null,null,null,null,null,null,null,null,null,null,null,null,"Fossiel vergelijk"]
[]
[]
[]
[null,null,null,"Omschrijving",null,null,null,"Levering Biomassacentrale Texel",null,null,null,null,null,null,null,null,null,null,null,"Omschrijving",null,null,null,null,null,null,"Chippen",null,null,null,null,null,null,null,null,"Omschrijving",null,null,null,null,null,null,"Transport naar afnemer",null,null,null,null,null,null,null,null,null,null,"Houtsoort",null,null,null,null,null,null,"Eiken",null,null,null,null,null,null,null,null,null,null,"Keten Fossiel (ter vergelijk)",null,null,null,null,null,null,null,null,"Aardgas"]
[null,null,null,"Houtsoort",null,null,null,null,null,null,"Loofhout mix NL",null,null,null,null,null,null,null,null,"Houtvorm proces",null,null,null,null,null,null,null,null,"Chips G50/P31,5",null,null,null,null,null,null,"Houtvorm",null,null,null,null,null,null,null,null,{"$f":"Proces_Vorm","v":"Chips G50/P31,5"},null,null,null,null,null,null,null,null,"Houtvorm",null,null,null,null,null,null,"Chips G30/P16",null,null,null,null,null,null,null,null,null,null,"Eindproduct",null,null,null,null,null,null,null,null,"Warmte",null,null,"-"]
[null,null,null,"Houtvorm oogst",null,null,null,null,null,null,"Top- en takhout",null,null,null,null,null,null,null,null,"Verandering Houthoeveelheid",null,null,null,null,null,null,null,null,-2,null,null,"%",null,null,null,"Verandering Houthoeveelheid",null,null,null,null,null,null,null,null,0,null,null,"%",null,null,null,null,null,"Vochtigheid / vochtgehalte",null,null,null,null,null,null,null,null,50,null,null,{"$f":"Uit_Hout_Vochtgehalte","v":100},"%",null,null,null,null,"Rendement omzetting",null,null,null,null,null,null,null,null,85,null,null,"%","i"]
[null,null,null,"Vochtigheid / vochtgehalte oogst",null,null,null,null,null,null,null,null,50,null,null,{"$f":"Uit_Hout_Vochtgehalte","v":100},"%",null,null,"Verandering Houtvochtigheid ",null,null,null,null,null,null,null,null,0,null,null,"%",null,null,null,"Verandering Houtvochtigheid ",null,null,null,null,null,null,null,null,0,null,null,"%",null,null,null,null,null,"Verandering Houtvochtigheid ",null,null,null,null,null,null,null,null,-20,null,null,"%",null,null,null,null,null,"CO2 productie ",null,null,null,null,null,"Hout",null,null,"Fossiel"]
[null,null,null,"Hoeveelheid",null,null,"naar eindgebruiker",null,null,null,null,null,10000,null,null,"m3",null,null,null,null,null,null,null,null,null,null,null,null,null,null,null,null,null,null,null,null,null,null,null,null,null,null,null,null,null,null,null,null,null,null,null,null,null,"Hoeveelheid",null,null,null,null,null,null,null,null,100,null,null,"tonds",null,null,null,null,null,null,"Front-End",null,null,null,null,null,null,null,85,null,null,"gCO2eq/MJ"]
[null,null,null,null,null,null,null,null,null,null,null,null,null,null,null,null,null,null,null,null,null,null,null,null,null,null,null,null,null,null,null,null,null,null,null,"Afstand - enkele reis",null,null,null,null,null,null,null,null,50,null,null,"km",null,null,null,null,null,null,null,null,null,null,null,null,null,null,null,null,null,null,null,null,null,null,null,null,"Omzetting",null,null,null,null,null,null,null,85,null,null,{"$f":"CF18","v":"gCO2eq/MJ"}]
[null,null,null,"CO2 Emissiefactoren volgens",null,null,null,null,null,null,"BioGrace - II",null,null,null,null,null,null,null,null,null,null,null,null,null,null,null,null,null,null,null,null,null,null,null,null,"Laadruimte",null,null,null,null,null,null,null,null,90,null,null,"m3",null,null,null,null,null,"Gebruik Warmte - EU standaard:  1.100 kWh/ton water",null,null,null,null,null,null,null,"(1.100kWh/ton water)",null,null,null,null,null,null,null,null,null,null,"Totaal",null,null,null,null,null,null,null,85,null,null,{"$f":"CF18","v":"gCO2eq/MJ"}]
[null,null,null,null,null,null,null,null,null,null,"CO2 emissiefactoren - 2018",null,null,null,null,null,null,null,null,null,null,null,null,null,null,null,null,null,null,null,null,null,null,null,null,"Laadvermogen",null,null,null,null,null,null,null,null,25,null,null,"ton",null,null,null,null,null,"Warmtebenutting",null,null,null,null,null,null,null,null,90,null,null,"%"]
[null,null,null,null,null,null,null,null,null,null,"Beide",null,null,null,null,null,null,null,null,null,null,null,null,null,null,null,null,null,null,null,null,null,null,null,null,"Belading heen",null,null,null,null,null,null,null,null,100,null,null,"%",null,null,null,null,null,"Warmtetoevoer",null,null,null,null,null,null,{"$f":"IF(Proces_Warmte_Ja_Nee=\"Nee\",\"\",\"1.100 / \"&IF(Drogen_Warmtebenutting=0,0,TEXT(1100*Drogen_Warmtebenutting/100,\"#.##\")))","v":{"$error":"#NAME?"}},null,null,{"$f":"IF(Proces_Warmte_Ja_Nee=\"Nee\",\"\",\"kWh/ton water\")","v":{"$error":"#NAME?"}}]
[null,null,null,null,null,null,null,null,null,null,null,null,null,null,null,null,null,null,null,null,null,null,null,null,null,null,null,null,null,null,null,null,null,null,null,"Belading terug",null,null,null,null,null,null,null,null,50,null,null,"%"]
[null,null,null,null,null,null,null,null,null,null,null,null,null,null,null,null,null,null,null,null,null,null,null,null,null,null,null,null,null,null,null,null,null,null,null,"Snelheid",null,null,null,null,null,null,null,null,55,null,null,"km/uur",null,null,null,null,null,"Aandeel elektriciteit",null,null,null,null,null,null,null,null,15,null,null,"%"]
[null,null,null,"Keten",null,null,"1a-Chips uit top- en tak hout uit bos of landschap"]
[null,null,null,"Pathway",null,null,{"$f":"LOOKUP(Hout_Keten_NL,Lijst_NL_Keten_Nr_Titel,Lijst_EU_Keten_Nr_Titel)","v":"1a-Woodchips from forest residues"},null,null,null,null,null,null,null,null,null,null,null,null,"Gebruik Brandstof",null,null,null,null,null,null,null,null,null,null,null,null,null,null,null,"Gebruik Brandstof",null,null,null,null,null,null,null,null,null,null,null,null,null,null,null,null,null,"Capaciteit",null,null,null,null,null,null,null,null,30,null,null,"m3/uur"]
[null,null,null,"Ketenstappen",null,null,null,null,null,null,"NL",null,"EU",null,null,null,null,null,null,"Werktuig",null,null,null,null,null,null,"Chipper",null,null,null,null,null,null,null,null,"Werktuig",null,null,null,null,null,null,"Vrachtauto DAF 250",null,null,null,null,null,null,null,null,null,null,"Brandstof",null,null,null,null,null,null,"EU-Diesel"]
[null,null,{"$f":"IF(VLOOKUP(Hout_Keten_NL,Lijst_NL_Keten,11)=\"\",\"\",1)","v":1},{"$f":"IF(VLOOKUP(Hout_Keten_NL,Lijst_NL_Keten,11)=\"\",\"\",VLOOKUP(Hout_Keten_NL,Lijst_NL_Keten,11))","v":"Inzamelen top- en takhout"},null,null,null,null,null,null,{"$f":"IF(VLOOKUP(Hout_Keten_NL,Lijst_NL_Keten,Keten_Stap1+0*Keten_Delta)=\"\",\"\",\nIF(Uit_NL_Keten_Totaal_CO2<1,IF(Uit_NL_Keten_Stap1_CO2<0.005,\"0,00\",TEXT(Uit_NL_Keten_Stap1_CO2,\"#.##0,00\")),\nIF(Uit_NL_Keten_Totaal_CO2<10,IF(Uit_NL_Keten_Stap1_CO2<0.05,\"0,0\",TEXT(Uit_NL_Keten_Stap1_CO2,\"#.##0,0\")),\nIF(Uit_NL_Keten_Totaal_CO2<50,IF(Uit_NL_Keten_Stap1_CO2<0.5,\"0\",TEXT(Uit_NL_Keten_Stap1_CO2,\"#.##\")),\nIF(Uit_NL_Keten_Stap1_CO2<0.5,\"0\",TEXT(Uit_NL_Keten_Stap1_CO2,\"#.##\"))))))","v":"0,8"},null,{"$f":"IF(VLOOKUP(Hout_Keten_NL,Lijst_NL_Keten,Keten_Stap1+0*Keten_Delta)=\"\",\"\",\nIF(Uit_NL_Keten_Totaal_CO2<1,IF(Uit_EU_Keten_Stap1_CO2<0.005,\"0,00\",TEXT(Uit_EU_Keten_Stap1_CO2,\"#.##0,00\")),\nIF(Uit_NL_Keten_Totaal_CO2<10,IF(Uit_EU_Keten_Stap1_CO2<0.05,\"0,0\",TEXT(Uit_EU_Keten_Stap1_CO2,\"#.##0,0\")),\nIF(Uit_NL_Keten_Totaal_CO2<50,IF(Uit_EU_Keten_Stap1_CO2<0.5,\"0\",TEXT(Uit_EU_Keten_Stap1_CO2,\"#.##\")),\nIF(Uit_EU_Keten_Stap1_CO2<0.5,\"0\",TEXT(Uit_EU_Keten_Stap1_CO2,\"#.##\"))))))","v":"1,5"},null,{"$f":"IF(VLOOKUP(Hout_Keten_NL,Lijst_NL_Keten,Keten_Stap1+0*Keten_Delta)=\"\",\"\",Uit_NL_EU_Keten_CO2_Dim)","v":"gCO2eq/MJ"},null,null,{"$f":"IF(VLOOKUP(Hout_Keten_NL,Lijst_NL_Keten,Keten_Stap1_CPT+0*Keten_Delta)=\"\",\"\",VLOOKUP(Hout_Keten_NL,Lijst_NL_Keten,Keten_Stap1_CPT+0*Keten_Delta))","v":"P"},null,"Capaciteit werktuig",null,null,null,null,null,null,null,{"$f":"IF(OR(AND(Proces_Verbrandingsmotor_Inzet=\"\",Proces_Verbrandingsmotor_Ja_Nee=\"Ja\"),\nAND(Proces_Verbrandingsmotor_Inzet_Dim=\"\",Proces_Verbrandingsmotor_Ja_Nee=\"Ja\")),\"▼\",\"\")","v":""},50,null,null,"m3/uur",null,null,null,"Brandstof",null,null,null,null,null,null,null,{"$f":"IF(AND(Transport_Verbrandingsmotor_Brandstof=\"\",Transport_Verbrandingsmotor_ID=1),\"▼\",\"\")","v":""},"EU-Diesel",null,null,null,null,null,null,null,null,"Brandstofverbruik",null,null,null,null,null,null,null,null,{"$f":"IF(Uit_Proces_Drogen_Brandstofverbruik<10,TEXT(Uit_Proces_Drogen_Brandstofverbruik,\"#.##0,0\"),TEXT(Uit_Proces_Drogen_Brandstofverbruik,\"#.##\"))","v":{"$error":"#NAME?"}},null,null,"kWh"]
[null,null,{"$f":"IF(VLOOKUP(Hout_Keten_NL,Lijst_NL_Keten,22)=\"\",\"\",2)","v":2},{"$f":"IF(VLOOKUP(Hout_Keten_NL,Lijst_NL_Keten,22)=\"\",\"\",VLOOKUP(Hout_Keten_NL,Lijst_NL_Keten,22))","v":"Drogen langs de weg"},null,null,null,null,null,null,{"$f":"IF(VLOOKUP(Hout_Keten_NL,Lijst_NL_Keten,Keten_Stap1+1*Keten_Delta)=\"\",\"\",\nIF(Uit_NL_Keten_Totaal_CO2<1,IF(Uit_NL_Keten_Stap2_CO2<0.005,\"0,00\",TEXT(Uit_NL_Keten_Stap2_CO2,\"#.##0,00\")),\nIF(Uit_NL_Keten_Totaal_CO2<10,IF(Uit_NL_Keten_Stap2_CO2<0.05,\"0,0\",TEXT(Uit_NL_Keten_Stap2_CO2,\"#.##0,0\")),\nIF(Uit_NL_Keten_Totaal_CO2<50,IF(Uit_NL_Keten_Stap2_CO2<0.5,\"0\",TEXT(Uit_NL_Keten_Stap2_CO2,\"#.##\")),\nIF(Uit_NL_Keten_Stap2_CO2<0.5,\"0\",TEXT(Uit_NL_Keten_Stap2_CO2,\"#.##\"))))))","v":"0,0"},null,{"$f":"IF(VLOOKUP(Hout_Keten_NL,Lijst_NL_Keten,Keten_Stap1+1*Keten_Delta)=\"\",\"\",\nIF(Uit_NL_Keten_Totaal_CO2<1,IF(Uit_EU_Keten_Stap2_CO2<0.005,\"0,00\",TEXT(Uit_EU_Keten_Stap2_CO2,\"#.##0,00\")),\nIF(Uit_NL_Keten_Totaal_CO2<10,IF(Uit_EU_Keten_Stap2_CO2<0.05,\"0,0\",TEXT(Uit_EU_Keten_Stap2_CO2,\"#.##0,0\")),\nIF(Uit_NL_Keten_Totaal_CO2<50,IF(Uit_EU_Keten_Stap2_CO2<0.5,\"0\",TEXT(Uit_EU_Keten_Stap2_CO2,\"#.##\")),\nIF(Uit_EU_Keten_Stap2_CO2<0.5,\"0\",TEXT(Uit_EU_Keten_Stap2_CO2,\"#.##\"))))))","v":"0,0"},null,{"$f":"IF(VLOOKUP(Hout_Keten_NL,Lijst_NL_Keten,Keten_Stap1+1*Keten_Delta)=\"\",\"\",Uit_NL_EU_Keten_CO2_Dim)","v":"gCO2eq/MJ"},null,null,{"$f":"IF(VLOOKUP(Hout_Keten_NL,Lijst_NL_Keten,Keten_Stap1_CPT+1*Keten_Delta)=\"\",\"\",VLOOKUP(Hout_Keten_NL,Lijst_NL_Keten,Keten_Stap1_CPT+1*Keten_Delta))","v":"P"},null,"Brandstof",null,null,null,null,null,null,null,{"$f":"IF(AND(Proces_Verbrandingsmotor_Brandstof=\"\",Proces_Verbrandingsmotor_Ja_Nee=\"Ja\"),\"▼\",\"\")","v":""},"EU-Diesel",null,null,null,null,null,null,"Euronorm/Categorie",null,null,null,null,null,null,null,null,"Euro 6",null,null,null,null,null,null,null,null,"Stroombron",null,null,null,null,null,null,"EU-Elektriciteit EU mix (0.4 kV)"]
[null,null,{"$f":"IF(VLOOKUP(Hout_Keten_NL,Lijst_NL_Keten,33)=\"\",\"\",3)","v":3},{"$f":"IF(VLOOKUP(Hout_Keten_NL,Lijst_NL_Keten,33)=\"\",\"\",VLOOKUP(Hout_Keten_NL,Lijst_NL_Keten,33))","v":"Chippen"},null,null,null,null,null,null,{"$f":"IF(VLOOKUP(Hout_Keten_NL,Lijst_NL_Keten,Keten_Stap1+2*Keten_Delta)=\"\",\"\",\nIF(Uit_NL_Keten_Totaal_CO2<1,IF(Uit_NL_Keten_Stap3_CO2<0.005,\"0,00\",TEXT(Uit_NL_Keten_Stap3_CO2,\"#.##0,00\")),\nIF(Uit_NL_Keten_Totaal_CO2<10,IF(Uit_NL_Keten_Stap3_CO2<0.05,\"0,0\",TEXT(Uit_NL_Keten_Stap3_CO2,\"#.##0,0\")),\nIF(Uit_NL_Keten_Totaal_CO2<50,IF(Uit_NL_Keten_Stap3_CO2<0.5,\"0\",TEXT(Uit_NL_Keten_Stap3_CO2,\"#.##\")),\nIF(Uit_NL_Keten_Stap3_CO2<0.5,\"0\",TEXT(Uit_NL_Keten_Stap3_CO2,\"#.##\"))))))","v":"0,7"},null,{"$f":"IF(VLOOKUP(Hout_Keten_NL,Lijst_NL_Keten,Keten_Stap1+2*Keten_Delta)=\"\",\"\",\nIF(Uit_NL_Keten_Totaal_CO2<1,IF(Uit_EU_Keten_Stap3_CO2<0.005,\"0,00\",TEXT(Uit_EU_Keten_Stap3_CO2,\"#.##0,00\")),\nIF(Uit_NL_Keten_Totaal_CO2<10,IF(Uit_EU_Keten_Stap3_CO2<0.05,\"0,0\",TEXT(Uit_EU_Keten_Stap3_CO2,\"#.##0,0\")),\nIF(Uit_NL_Keten_Totaal_CO2<50,IF(Uit_EU_Keten_Stap3_CO2<0.5,\"0\",TEXT(Uit_EU_Keten_Stap3_CO2,\"#.##\")),\nIF(Uit_EU_Keten_Stap3_CO2<0.5,\"0\",TEXT(Uit_EU_Keten_Stap3_CO2,\"#.##\"))))))","v":"0,4"},null,{"$f":"IF(VLOOKUP(Hout_Keten_NL,Lijst_NL_Keten,Keten_Stap1+2*Keten_Delta)=\"\",\"\",Uit_NL_EU_Keten_CO2_Dim)","v":"gCO2eq/MJ"},null,null,{"$f":"IF(VLOOKUP(Hout_Keten_NL,Lijst_NL_Keten,Keten_Stap1_CPT+2*Keten_Delta)=\"\",\"\",VLOOKUP(Hout_Keten_NL,Lijst_NL_Keten,Keten_Stap1_CPT+2*Keten_Delta))","v":"P"},null,"Euronorm/Categorie",null,null,null,null,null,null,null,null,"Euro 5",null,null,null,null,null,null,"Brandstofverbruik",null,null,null,null,null,null,null,{"$f":"IF(OR(AND(Transport_Verbrandingsmotor_Verbruik=\"\",Transport_Verbrandingsmotor_ID=1),\nAND(Transport_Verbrandingsmotor_Verbruik_Dim=\"\",Transport_Verbrandingsmotor_ID=1)),\"▼\",\"\")","v":""},30,null,null,"liter/100km",null,null,null,null,null,"Stroomverbruik",null,null,null,null,null,null,null,null,{"$f":"IF(Uit_Proces_Drogen_Elektriciteitsverbruik<10,TEXT(Uit_Proces_Drogen_Elektriciteitsverbruik,\"#.##0,0\"),TEXT(Uit_Proces_Drogen_Elektriciteitsverbruik,\"#.##\"))","v":{"$error":"#NAME?"}},null,null,"kWh"]
[null,null,{"$f":"IF(VLOOKUP(Hout_Keten_NL,Lijst_NL_Keten,44)=\"\",\"\",4)","v":4},{"$f":"IF(VLOOKUP(Hout_Keten_NL,Lijst_NL_Keten,44)=\"\",\"\",VLOOKUP(Hout_Keten_NL,Lijst_NL_Keten,44))","v":"Transport chips naar afnemer"},null,null,null,null,null,null,{"$f":"IF(VLOOKUP(Hout_Keten_NL,Lijst_NL_Keten,Keten_Stap1+3*Keten_Delta)=\"\",\"\",\nIF(Uit_NL_Keten_Totaal_CO2<1,IF(Uit_NL_Keten_Stap4_CO2<0.005,\"0,00\",TEXT(Uit_NL_Keten_Stap4_CO2,\"#.##0,00\")),\nIF(Uit_NL_Keten_Totaal_CO2<10,IF(Uit_NL_Keten_Stap4_CO2<0.05,\"0,0\",TEXT(Uit_NL_Keten_Stap4_CO2,\"#.##0,0\")),\nIF(Uit_NL_Keten_Totaal_CO2<50,IF(Uit_NL_Keten_Stap4_CO2<0.5,\"0\",TEXT(Uit_NL_Keten_Stap4_CO2,\"#.##\")),\nIF(Uit_NL_Keten_Stap4_CO2<0.5,\"0\",TEXT(Uit_NL_Keten_Stap4_CO2,\"#.##\"))))))","v":"0,9"},null,{"$f":"IF(VLOOKUP(Hout_Keten_NL,Lijst_NL_Keten,Keten_Stap1+3*Keten_Delta)=\"\",\"\",\nIF(Uit_NL_Keten_Totaal_CO2<1,IF(Uit_EU_Keten_Stap4_CO2<0.005,\"0,00\",TEXT(Uit_EU_Keten_Stap4_CO2,\"#.##0,00\")),\nIF(Uit_NL_Keten_Totaal_CO2<10,IF(Uit_EU_Keten_Stap4_CO2<0.05,\"0,0\",TEXT(Uit_EU_Keten_Stap4_CO2,\"#.##0,0\")),\nIF(Uit_NL_Keten_Totaal_CO2<50,IF(Uit_EU_Keten_Stap4_CO2<0.5,\"0\",TEXT(Uit_EU_Keten_Stap4_CO2,\"#.##\")),\nIF(Uit_EU_Keten_Stap4_CO2<0.5,\"0\",TEXT(Uit_EU_Keten_Stap4_CO2,\"#.##\"))))))","v":"3,0"},null,{"$f":"IF(VLOOKUP(Hout_Keten_NL,Lijst_NL_Keten,Keten_Stap1+3*Keten_Delta)=\"\",\"\",Uit_NL_EU_Keten_CO2_Dim)","v":"gCO2eq/MJ"},null,null,{"$f":"IF(VLOOKUP(Hout_Keten_NL,Lijst_NL_Keten,Keten_Stap1_CPT+3*Keten_Delta)=\"\",\"\",VLOOKUP(Hout_Keten_NL,Lijst_NL_Keten,Keten_Stap1_CPT+3*Keten_Delta))","v":"T"},null,"Brandstofverbruik",null,null,null,null,null,null,null,{"$f":"IF(OR(AND(Proces_Verbrandingsmotor_Verbruik=\"\",Proces_Verbrandingsmotor_Ja_Nee=\"Ja\"),\nAND(Proces_Verbrandingsmotor_Verbruik_Dim=\"\",Proces_Verbrandingsmotor_Ja_Nee=\"Ja\")),\"▼\",\"\")","v":""},50,null,null,"liter/uur"]
[null,null,{"$f":"IF(VLOOKUP(Hout_Keten_NL,Lijst_NL_Keten,55)=\"\",\"\",5)","v":""},{"$f":"IF(VLOOKUP(Hout_Keten_NL,Lijst_NL_Keten,55)=\"\",\"\",VLOOKUP(Hout_Keten_NL,Lijst_NL_Keten,55))","v":""},null,null,null,null,null,null,{"$f":"IF(VLOOKUP(Hout_Keten_NL,Lijst_NL_Keten,Keten_Stap1+4*Keten_Delta)=\"\",\"\",\nIF(Uit_NL_Keten_Totaal_CO2<1,IF(Uit_NL_Keten_Stap5_CO2<0.005,\"0,00\",TEXT(Uit_NL_Keten_Stap5_CO2,\"#.##0,00\")),\nIF(Uit_NL_Keten_Totaal_CO2<10,IF(Uit_NL_Keten_Stap5_CO2<0.05,\"0,0\",TEXT(Uit_NL_Keten_Stap5_CO2,\"#.##0,0\")),\nIF(Uit_NL_Keten_Totaal_CO2<50,IF(Uit_NL_Keten_Stap5_CO2<0.5,\"0\",TEXT(Uit_NL_Keten_Stap5_CO2,\"#.##\")),\nIF(Uit_NL_Keten_Stap5_CO2<0.5,\"0\",TEXT(Uit_NL_Keten_Stap5_CO2,\"#.##\"))))))","v":""},null,{"$f":"IF(VLOOKUP(Hout_Keten_NL,Lijst_NL_Keten,Keten_Stap1+4*Keten_Delta)=\"\",\"\",\nIF(Uit_NL_Keten_Totaal_CO2<1,IF(Uit_EU_Keten_Stap5_CO2<0.005,\"0,00\",TEXT(Uit_EU_Keten_Stap5_CO2,\"#.##0,00\")),\nIF(Uit_NL_Keten_Totaal_CO2<10,IF(Uit_EU_Keten_Stap5_CO2<0.05,\"0,0\",TEXT(Uit_EU_Keten_Stap5_CO2,\"#.##0,0\")),\nIF(Uit_NL_Keten_Totaal_CO2<50,IF(Uit_EU_Keten_Stap5_CO2<0.5,\"0\",TEXT(Uit_EU_Keten_Stap5_CO2,\"#.##\")),\nIF(Uit_EU_Keten_Stap5_CO2<0.5,\"0\",TEXT(Uit_EU_Keten_Stap5_CO2,\"#.##\"))))))","v":""},null,{"$f":"IF(VLOOKUP(Hout_Keten_NL,Lijst_NL_Keten,Keten_Stap1+4*Keten_Delta)=\"\",\"\",Uit_NL_EU_Keten_CO2_Dim)","v":""},null,null,{"$f":"IF(VLOOKUP(Hout_Keten_NL,Lijst_NL_Keten,Keten_Stap1_CPT+4*Keten_Delta)=\"\",\"\",VLOOKUP(Hout_Keten_NL,Lijst_NL_Keten,Keten_Stap1_CPT+4*Keten_Delta))","v":""}]
[null,null,{"$f":"IF(VLOOKUP(Hout_Keten_NL,Lijst_NL_Keten,77)=\"\",\"\",6)","v":""},{"$f":"IF(VLOOKUP(Hout_Keten_NL,Lijst_NL_Keten,63)=\"\",\"\",VLOOKUP(Hout_Keten_NL,Lijst_NL_Keten,63))","v":""},null,null,null,null,null,null,{"$f":"IF(VLOOKUP(Hout_Keten_NL,Lijst_NL_Keten,Keten_Stap1+5*Keten_Delta)=\"\",\"\",\nIF(Uit_NL_Keten_Totaal_CO2<1,IF(Uit_NL_Keten_Stap6_CO2<0.005,\"0,00\",TEXT(Uit_NL_Keten_Stap6_CO2,\"#.##0,00\")),\nIF(Uit_NL_Keten_Totaal_CO2<10,IF(Uit_NL_Keten_Stap6_CO2<0.05,\"0,0\",TEXT(Uit_NL_Keten_Stap6_CO2,\"#.##0,0\")),\nIF(Uit_NL_Keten_Totaal_CO2<50,IF(Uit_NL_Keten_Stap6_CO2<0.5,\"0\",TEXT(Uit_NL_Keten_Stap6_CO2,\"#.##\")),\nIF(Uit_NL_Keten_Stap6_CO2<0.5,\"0\",TEXT(Uit_NL_Keten_Stap6_CO2,\"#.##\"))))))","v":""},null,{"$f":"IF(VLOOKUP(Hout_Keten_NL,Lijst_NL_Keten,Keten_Stap1+5*Keten_Delta)=\"\",\"\",\nIF(Uit_NL_Keten_Totaal_CO2<1,IF(Uit_EU_Keten_Stap6_CO2<0.005,\"0,00\",TEXT(Uit_EU_Keten_Stap6_CO2,\"#.##0,00\")),\nIF(Uit_NL_Keten_Totaal_CO2<10,IF(Uit_EU_Keten_Stap6_CO2<0.05,\"0,0\",TEXT(Uit_EU_Keten_Stap6_CO2,\"#.##0,0\")),\nIF(Uit_NL_Keten_Totaal_CO2<50,IF(Uit_EU_Keten_Stap6_CO2<0.5,\"0\",TEXT(Uit_EU_Keten_Stap6_CO2,\"#.##\")),\nIF(Uit_EU_Keten_Stap6_CO2<0.5,\"0\",TEXT(Uit_EU_Keten_Stap6_CO2,\"#.##\"))))))","v":""},null,{"$f":"IF(VLOOKUP(Hout_Keten_NL,Lijst_NL_Keten,Keten_Stap1+5*Keten_Delta)=\"\",\"\",Uit_NL_EU_Keten_CO2_Dim)","v":""},null,null,{"$f":"IF(VLOOKUP(Hout_Keten_NL,Lijst_NL_Keten,Keten_Stap1_CPT+5*Keten_Delta)=\"\",\"\",VLOOKUP(Hout_Keten_NL,Lijst_NL_Keten,Keten_Stap1_CPT+5*Keten_Delta))","v":""},null,"Gebruik Elektriciteit",null,null,null,null,null,null,null,null,null,null,null,null,null,null,null,"Gebruik Elektriciteit",null,null,null,null,null,null,null,null,null,null,null,null,null,null,null,null,null,"CO2 emissie brandstof",null,null,null,null,null,null,null,{"$f":"IF(Uit_Transport_Brandstof_CO2<50,TEXT(Uit_Transport_Brandstof_CO2,\"#.##0,0\"),TEXT(Uit_Transport_Brandstof_CO2,\"#.##\"))","v":"0,3"},null,null,"gCO2eq/MJ"]
[null,null,null,null,null,null,null,null,null,null,null,null,null,null,null,null,null,null,null,"Werktuig",null,null,null,null,null,null,"Hulpaandrijving",null,null,null,null,null,null,null,null,"n.v.t.",null,null,null,null,null,null,null,null,null,null,null,null,null,null,null,null,null,"CO2 emissie elektriciteit",null,null,null,null,null,null,null,{"$f":"IF(Uit_Transport_Stroom_CO2<50,TEXT(Uit_Transport_Stroom_CO2,\"#.##0,0\"),TEXT(Uit_Transport_Stroom_CO2,\"#.##\"))","v":"0,0"},null,null,{"$f":"Uit_Transport_Verbrandingsmotor_CO2_Dim","v":"gCO2eq/MJ"}]
[null,null,null,null,null,null,null,null,null,null,null,null,null,null,null,null,null,null,null,null,"Verbruik",null,null,null,null,null,null,{"$f":"IF(OR(AND(Proces_Elektromotor_VermogenVerbruik=\"\",Proces_Elektromotor_Ja_Nee=\"Ja\"),\nAND(Proces_Elektromotor_VermogenVerbruik_Dim=\"\",Proces_Elektromotor_Ja_Nee=\"Ja\")),\"▼\",\"\")","v":""},2500,null,null,"kWh",null,null,null,null,"n.v.t.",null,null,null,null,null,null,{"$f":"IF(OR(AND(Transport_Elektromotor_VermogenVerbruik=\"\",Transport_Elektromotor_Ja_Nee=\"Ja\"),\nAND(Transport_Elektromotor_VermogenVerbruik_Dim=\"\",Transport_Elektromotor_Ja_Nee=\"Ja\")),\"▼\",\"\")","v":""},null,null,null,null,null,null,null,null,null,"CO2 emissie droogproces",null,null,null,null,null,null,null,{"$f":"IF(Uit_Transport_Basis_CO2<50,TEXT(Uit_Transport_Basis_CO2,\"#.##0,0\"),TEXT(Uit_Transport_Basis_CO2,\"#.##\"))","v":"0,0"},null,null,{"$f":"Uit_Transport_Verbrandingsmotor_CO2_Dim","v":"gCO2eq/MJ"},null,null,null,null,null,null,null,null,null,null,null,null,null,null,null,null,null,null,null,null,null,null,null,null,{"$f":"IF(VLOOKUP(Hout_Keten_NL,Lijst_2D_Keten_Stap_Detail_NL,1+Hout_Keten_Stap_Detail_Nr)=\"\",\"Geen ketenstap\",VLOOKUP(Hout_Keten_NL,Lijst_2D_Keten_Stap_Detail_NL,1+Hout_Keten_Stap_Detail_Nr))","v":"Bundelen en stobben oogsten is geen gebruikelijk praktijk in NL. Uitrijden varieert - afhankelijk van de situatie - tussen ca. 1 en 2 liter per verse ton. Het conservatief  gemiddelde op basis van de gegevens van de partijen uit de keten in NL wordt gesteld op ca. 2 liter per verse ton. Dit is ca. 4 liter per ton droge stof. Een aantal bedrijven in Nederland chippen in het bos, en rijden met trekker en dumper uit naar het bospad. Dit scenario is in dit project niet beschreven."}]
[null,null,null,null,null,null,null,null,null,null,null,null,null,null,null,null,null,null,null,"Stroombron",null,null,null,null,null,{"$f":"IF(AND(Proces_Elektromotor_Stroombron=\"\",Proces_Elektromotor_Ja_Nee=\"Ja\"),\"▼\",\"\")","v":""},"EU-Elektriciteit NL",null,null,null,null,null,null,null,null,"n.v.t.",null,null,null,null,null,{"$f":"IF(AND(Transport_Elektromotor_Stroombron=\"\",Transport_Elektromotor_Ja_Nee=\"Ja\"),\"▼\",\"\")","v":""},null,null,null,null,null,null,null,null,null,null,null,null,null,null,null,null,null,null,null,null,null,null,null,null,null,null,null,null,null,null,null,null,null,null,null,null,null,null,null,null,null,null,null,null,null,null,null,{"$f":"IF(VLOOKUP(Hout_Keten_EU,Lijst_EU_Keten,Keten_Titel_NL_EU)=\"NL\",\"\",\nIF(VLOOKUP(Hout_Keten_EU,Lijst_2D_Keten_Stap_Detail_EU,1+Hout_Keten_Stap_Detail_Nr)=\"\",\"Geen ketenstap\",\nVLOOKUP(Hout_Keten_EU,Lijst_2D_Keten_Stap_Detail_EU,1+Hout_Keten_Stap_Detail_Nr)))","v":"Dit is inclusief forwarden, bundelen, oliegebruik, transport van machines van en naar de werkplek, laden en lossen. Het bevat scenario's los top- en takhout, bundelen en oogst van stobben. Voor het olieverbruik wordt uitgegaan van 6 % van het dieselverbruik van de machines. De emissiefactor van olie is gelijkgesteld aan diesel. \nDe vochtigheid (M) is aangenomen op 50 %."}]
[null,null,null,null,null,null,null,null,null,null,null,null,null,null,null,null,null,null,null,"n.v.T.",null,null,null,null,null,null,null,{"$f":"IF(AND(Proces_Elektromotor_Loadfactor=\"\",Proces_Elektromotor_Ja_Nee=\"Ja\",Proces_Elektromotor_Vermogen_Verbruik=\"Vermogen\"),\"▼\",\"\")","v":""},null,null,null,null,null,null,null,"Loadfactor",null,null,null,null,null,null,null,{"$f":"IF(AND(Transport_Elektromotor_Loadfactor=\"\",Transport_Elektromotor_Ja_Nee=\"Ja\",Transport_Elektromotor_Vermogen_Verbruik=\"Vermogen\"),\"▼\",\"\")","v":""},null,null,null,"%"]
[null,null,null,null,null,null,null,null,null,null,null,null,null,null,null,null,null,null,null,"n.v.t.",null,null,null,null,null,null,null,{"$f":"IF(OR(AND(Proces_Elektromotor_Capaciteit=\"\",Proces_Elektromotor_Ja_Nee=\"Ja\",Proces_Elektromotor_Vermogen_Verbruik=\"Vermogen\"),\nAND(Proces_Elektromotor_Capaciteit_Dim=\"\",Proces_Elektromotor_Ja_Nee=\"Ja\",Proces_Elektromotor_Vermogen_Verbruik=\"Vermogen\")),\"▼\",\"\")","v":""},50,null,null,"m3/uur"]
[null,null,"EU"]
[]
[null,null,null,null,null,null,null,null,null,null,null,null,null,null,null,null,null,null,null,"Basis CO2 productie",null,null,null,null,null,null,null,null,10000,null,null,"kgCO2eq",null,null,null,"Basis CO2 productie",null,null,null,null,null,null,null,null,0,null,null,"gCO2eq/tkm",null,null,null,null,null,{"$f":"IF(Uit_NL_Keten_Stap1_CO2<1,IF(Uit_NL_Keten_Stap1_CO2<0.005,\"0,00\",TEXT(Uit_NL_Keten_Stap1_CO2,\"#.##0,00\")),\nIF(Uit_NL_Keten_Totaal_CO2<10,IF(Uit_NL_Keten_Stap1_CO2<0.05,\"0,0\",TEXT(Uit_NL_Keten_Stap1_CO2,\"#.##0,0\")),\nIF(Uit_NL_Keten_Totaal_CO2<50,IF(Uit_NL_Keten_Stap1_CO2<0.5,\"0\",TEXT(Uit_NL_Keten_Stap1_CO2,\"#.##\")),\nIF(Uit_NL_Keten_Stap1_CO2<0.5,\"0\",TEXT(Uit_NL_Keten_Stap1_CO2,\"#.##\")))))","v":"0,78"}]
[null,null,null,"Detailinformatie Stap:",null,null,null,null,1]
[]
[null,null,null,null,null,null,null,null,null,null,null,null,null,null,null,null,null,null,null,null,null,null,null,null,null,null,{"$f":"IF(Uit_Proces_Invoer_Uitvoer_Dim=\"Uitvoer\",\"\",\"Let op CO2/MJ is op invoer\")","v":""},null,null,null,null,null,null,null,null,null,null,null,null,null,null,null,{"$f":"IF(Uit_Transport_Invoer_Uitvoer_Dim=\"Uitvoer\",\"\",\"Let op CO2/MJ is op invoer\")","v":""}]
[null,null,null,null,null,null,null,null,null,null,"NL",null,"EU",null,null,null,null,null,null,null,"CO2 gebaseerd op:",null,null,null,null,null,"Uitvoer",null,null,{"$f":"IF(Uit_Proces_Invoer_Uitvoer_Dim=\"Invoer\",\"van Hout\",\"naar Transport\")","v":"naar Transport"},null,null,null,null,null,null,"CO2 gebaseerd op:",null,null,null,null,null,"Uitvoer",null,null,{"$f":"IF(Uit_Transport_Invoer_Uitvoer_Dim=\"Invoer\",\"van Proces\",\"naar eindgebruiker\")","v":"naar eindgebruiker"}]
[null,null,null,"Teelt",null,null,null,null,null,null,{"$f":"IF(Uit_NL_Keten_Totaal_CO2<1,IF(Uit_NL_Keten_Cultivatie_CO2<0.005,\"0,00\",TEXT(Uit_NL_Keten_Cultivatie_CO2,\"#.##0,00\")),\nIF(Uit_NL_Keten_Totaal_CO2<10,IF(Uit_NL_Keten_Cultivatie_CO2<0.05,\"0,0\",TEXT(Uit_NL_Keten_Cultivatie_CO2,\"#.##0,0\")),\nIF(Uit_NL_Keten_Totaal_CO2<50,IF(Uit_NL_Keten_Cultivatie_CO2<0.5,\"0\",TEXT(Uit_NL_Keten_Cultivatie_CO2,\"#.##\")),\nIF(Uit_NL_Keten_Cultivatie_CO2<0.5,\"0\",TEXT(Uit_NL_Keten_Cultivatie_CO2,\"#.##\")))))","v":"0,0"},null,{"$f":"IF(VLOOKUP(Hout_Keten_EU,Lijst_EU_Keten,Keten_Titel_NL_EU)=\"NL\",\"\",\nIF(Uit_EU_Keten_Totaal_CO2<1,IF(Uit_EU_Keten_Cultivatie_CO2<0.005,\"0,00\",TEXT(Uit_EU_Keten_Cultivatie_CO2,\"#.##0,00\")),\nIF(Uit_EU_Keten_Totaal_CO2<10,IF(Uit_EU_Keten_Cultivatie_CO2<0.05,\"0,0\",TEXT(Uit_EU_Keten_Cultivatie_CO2,\"#.##0,0\")),\nIF(Uit_EU_Keten_Totaal_CO2<50,IF(Uit_EU_Keten_Cultivatie_CO2<0.5,\"0\",TEXT(Uit_EU_Keten_Cultivatie_CO2,\"#.##\")),\nIF(Uit_EU_Keten_Cultivatie_CO2<0.5,\"0\",TEXT(Uit_EU_Keten_Cultivatie_CO2,\"#.##\"))))))","v":"0,0"},null,"gCO2eq/MJ",null,null,null,null,null,"CO2 Verbrandingsmotor",null,null,null,null,null,{"$f":"IF(Uit_Proces_CO2T<1,IF(Uit_Proces_Brandstof_CO2<0.005,\"0,00\",TEXT(Uit_Proces_Brandstof_CO2,\"#.##0,00\")),\nIF(Uit_Proces_CO2T<10,IF(Uit_Proces_Brandstof_CO2<0.05,\"0,0\",TEXT(Uit_Proces_Brandstof_CO2,\"#.##0,0\")),\nIF(Uit_Proces_CO2T<50,IF(Uit_Proces_Brandstof_CO2<0.5,\"0\",TEXT(Uit_Proces_Brandstof_CO2,\"#.##\")),\nIF(Uit_Proces_Brandstof_CO2<0.5,\"0\",TEXT(Uit_Proces_Brandstof_CO2,\"#.##\")))))","v":"1,1"},null,null,"gCO2eq/MJ",null,null,null,null,null,null,"CO2 Verbranding",null,null,null,null,null,{"$f":"IF(Uit_Transport_CO2T<1,IF(Uit_Transport_Brandstof_CO2<0.005,\"0,00\",TEXT(Uit_Transport_Brandstof_CO2,\"#.##0,00\")),\nIF(Uit_Transport_CO2T<10,IF(Uit_Transport_Brandstof_CO2<0.05,\"0,0\",TEXT(Uit_Transport_Brandstof_CO2,\"#.##0,0\")),\nIF(Uit_Transport_CO2T<50,IF(Uit_Transport_Brandstof_CO2<0.5,\"0\",TEXT(Uit_Transport_Brandstof_CO2,\"#.##\")),\nIF(Uit_Transport_Brandstof_CO2<0.5,\"0\",TEXT(Uit_Transport_Brandstof_CO2,\"#.##\")))))","v":"0,30"},null,null,"gCO2eq/MJ"]
[null,null,null,"Proces",null,null,null,null,null,null,{"$f":"IF(Uit_NL_Keten_Totaal_CO2<1,IF(Uit_NL_Keten_Proces_CO2<0.005,\"0,00\",TEXT(Uit_NL_Keten_Proces_CO2,\"#.##0,00\")),\nIF(Uit_NL_Keten_Totaal_CO2<10,IF(Uit_NL_Keten_Proces_CO2<0.05,\"0,0\",TEXT(Uit_NL_Keten_Proces_CO2,\"#.##0,0\")),\nIF(Uit_NL_Keten_Totaal_CO2<50,IF(Uit_NL_Keten_Proces_CO2<0.5,\"0\",TEXT(Uit_NL_Keten_Proces_CO2,\"#.##\")),\nIF(Uit_NL_Keten_Proces_CO2<0.5,\"0\",TEXT(Uit_NL_Keten_Proces_CO2,\"#.##\")))))","v":"1,5"},null,{"$f":"IF(VLOOKUP(Hout_Keten_EU,Lijst_EU_Keten,Keten_Titel_NL_EU)=\"NL\",\"\",\nIF(Uit_EU_Keten_Totaal_CO2<1,IF(Uit_EU_Keten_Proces_CO2<0.005,\"0,00\",TEXT(Uit_EU_Keten_Proces_CO2,\"#.##0,00\")),\nIF(Uit_EU_Keten_Totaal_CO2<10,IF(Uit_EU_Keten_Proces_CO2<0.05,\"0,0\",TEXT(Uit_EU_Keten_Proces_CO2,\"#.##0,0\")),\nIF(Uit_EU_Keten_Totaal_CO2<50,IF(Uit_EU_Keten_Proces_CO2<0.5,\"0\",TEXT(Uit_EU_Keten_Proces_CO2,\"#.##\")),\nIF(Uit_EU_Keten_Proces_CO2<0.5,\"0\",TEXT(Uit_EU_Keten_Proces_CO2,\"#.##\"))))))","v":"1,8"},null,{"$f":"O46","v":"gCO2eq/MJ"},null,null,null,null,null,"CO2 Elektromotor",null,null,null,null,null,{"$f":"IF(Uit_Proces_CO2T<1,IF(Uit_Proces_Stroom_CO2<0.005,\"0,00\",TEXT(Uit_Proces_Stroom_CO2,\"#.##0,00\")),\nIF(Uit_Proces_CO2T<10,IF(Uit_Proces_Stroom_CO2<0.05,\"0,0\",TEXT(Uit_Proces_Stroom_CO2,\"#.##0,0\")),\nIF(Uit_Proces_CO2T<50,IF(Uit_Proces_Stroom_CO2<0.5,\"0\",TEXT(Uit_Proces_Stroom_CO2,\"#.##\")),\nIF(Uit_Proces_Stroom_CO2<0.5,\"0\",TEXT(Uit_Proces_Stroom_CO2,\"#.##\")))))","v":"0,0"},null,null,{"$f":"Uit_Proces_Verbrandingsmotor_CO2_Dim","v":"gCO2eq/MJ"},null,null,null,null,null,null,"CO2 Elektromotor",null,null,null,null,null,{"$f":"IF(Uit_Transport_CO2T<1,IF(Uit_Transport_Stroom_CO2<0.005,\"0,00\",TEXT(Uit_Transport_Stroom_CO2,\"#.##0,00\")),\nIF(Uit_Transport_CO2T<10,IF(Uit_Transport_Stroom_CO2<0.05,\"0,0\",TEXT(Uit_Transport_Stroom_CO2,\"#.##0,0\")),\nIF(Uit_Transport_CO2T<50,IF(Uit_Transport_Stroom_CO2<0.5,\"0\",TEXT(Uit_Transport_Stroom_CO2,\"#.##\")),\nIF(Uit_Transport_Stroom_CO2<0.5,\"0\",TEXT(Uit_Transport_Stroom_CO2,\"#.##\")))))","v":"0,00"},null,null,{"$f":"Uit_Transport_Verbrandingsmotor_CO2_Dim","v":"gCO2eq/MJ"}]
[null,null,null,"Transport",null,null,null,null,null,null,{"$f":"IF(Uit_NL_Keten_Totaal_CO2<1,IF(Uit_NL_Keten_Transport_CO2<0.005,\"0,00\",TEXT(Uit_NL_Keten_Transport_CO2,\"#.##0,00\")),\nIF(Uit_NL_Keten_Totaal_CO2<10,IF(Uit_NL_Keten_Transport_CO2<0.05,\"0,0\",TEXT(Uit_NL_Keten_Transport_CO2,\"#.##0,0\")),\nIF(Uit_NL_Keten_Totaal_CO2<50,IF(Uit_NL_Keten_Transport_CO2<0.5,\"0\",TEXT(Uit_NL_Keten_Transport_CO2,\"#.##\")),\nIF(Uit_NL_Keten_Transport_CO2<0.5,\"0\",TEXT(Uit_NL_Keten_Transport_CO2,\"#.##\")))))","v":"0,9"},null,{"$f":"IF(VLOOKUP(Hout_Keten_EU,Lijst_EU_Keten,Keten_Titel_NL_EU)=\"NL\",\"\",\nIF(Uit_EU_Keten_Totaal_CO2<1,IF(Uit_EU_Keten_Transport_CO2<0.005,\"0,00\",TEXT(Uit_EU_Keten_Transport_CO2,\"#.##0,00\")),\nIF(Uit_EU_Keten_Totaal_CO2<10,IF(Uit_EU_Keten_Transport_CO2<0.05,\"0,0\",TEXT(Uit_EU_Keten_Transport_CO2,\"#.##0,0\")),\nIF(Uit_EU_Keten_Totaal_CO2<50,IF(Uit_EU_Keten_Transport_CO2<0.5,\"0\",TEXT(Uit_EU_Keten_Transport_CO2,\"#.##\")),\nIF(Uit_EU_Keten_Transport_CO2<0.5,\"0\",TEXT(Uit_EU_Keten_Transport_CO2,\"#.##\"))))))","v":"3,0"},null,{"$f":"O46","v":"gCO2eq/MJ"},null,null,null,null,null,"CO2 Basis",null,null,null,null,null,{"$f":"IF(Uit_Proces_CO2T<1,IF(Uit_Proces_Basis_CO2<0.005,\"0,00\",TEXT(Uit_Proces_Basis_CO2,\"#.##0,00\")),\nIF(Uit_Proces_CO2T<10,IF(Uit_Proces_Basis_CO2<0.05,\"0,0\",TEXT(Uit_Proces_Basis_CO2,\"#.##0,0\")),\nIF(Uit_Proces_CO2T<50,IF(Uit_Proces_Basis_CO2<0.5,\"0\",TEXT(Uit_Proces_Basis_CO2,\"#.##\")),\nIF(Uit_Proces_Basis_CO2<0.5,\"0\",TEXT(Uit_Proces_Basis_CO2,\"#.##\")))))","v":"0,3"},null,null,{"$f":"Uit_Proces_Verbrandingsmotor_CO2_Dim","v":"gCO2eq/MJ"},null,null,null,null,null,null,"CO2 Basis",null,null,null,null,null,{"$f":"IF(Uit_Transport_CO2T<1,IF(Uit_Transport_Basis_CO2<0.005,\"0,00\",TEXT(Uit_Transport_Basis_CO2,\"#.##0,00\")),\nIF(Uit_Transport_CO2T<10,IF(Uit_Transport_Basis_CO2<0.05,\"0,0\",TEXT(Uit_Transport_Basis_CO2,\"#.##0,0\")),\nIF(Uit_Transport_CO2T<50,IF(Uit_Transport_Basis_CO2<0.5,\"0\",TEXT(Uit_Transport_Basis_CO2,\"#.##\")),\nIF(Uit_Transport_Basis_CO2<0.5,\"0\",TEXT(Uit_Transport_Basis_CO2,\"#.##\")))))","v":"0,00"},null,null,{"$f":"Uit_Transport_Verbrandingsmotor_CO2_Dim","v":"gCO2eq/MJ"}]
[null,null,null,"Totaal",null,null,null,null,null,null,{"$f":"IF(Uit_NL_Keten_Totaal_CO2<1,IF(Uit_NL_Keten_Totaal_CO2<0.005,\"0,00\",TEXT(Uit_NL_Keten_Totaal_CO2,\"#.##0,00\")),\nIF(Uit_NL_Keten_Totaal_CO2<10,IF(Uit_NL_Keten_Totaal_CO2<0.05,\"0,0\",TEXT(Uit_NL_Keten_Totaal_CO2,\"#.##0,0\")),\nIF(Uit_NL_Keten_Totaal_CO2<50,IF(Uit_NL_Keten_Totaal_CO2<0.5,\"0\",TEXT(Uit_NL_Keten_Totaal_CO2,\"#.##\")),\nIF(Uit_NL_Keten_Totaal_CO2<0.5,\"0\",TEXT(Uit_NL_Keten_Totaal_CO2,\"#.##\")))))","v":"2,4"},null,{"$f":"IF(VLOOKUP(Hout_Keten_EU,Lijst_EU_Keten,Keten_Titel_NL_EU)=\"NL\",\"\",\nIF(Uit_EU_Keten_Totaal_CO2<1,IF(Uit_EU_Keten_Totaal_CO2<0.005,\"0,00\",TEXT(Uit_EU_Keten_Totaal_CO2,\"#.##0,00\")),\nIF(Uit_EU_Keten_Totaal_CO2<10,IF(Uit_EU_Keten_Totaal_CO2<0.05,\"0,0\",TEXT(Uit_EU_Keten_Totaal_CO2,\"#.##0,0\")),\nIF(Uit_EU_Keten_Totaal_CO2<50,IF(Uit_EU_Keten_Totaal_CO2<0.5,\"0\",TEXT(Uit_EU_Keten_Totaal_CO2,\"#.##\")),\nIF(Uit_EU_Keten_Totaal_CO2<0.5,\"0\",TEXT(Uit_EU_Keten_Totaal_CO2,\"#.##\"))))))","v":"4,8"},null,{"$f":"O46","v":"gCO2eq/MJ"},null,null,null,null,null,"CO2 Totaal",null,null,null,null,null,{"$f":"IF(Uit_Proces_CO2T<1,IF(Uit_Proces_CO2T<0.005,\"0,00\",TEXT(Uit_Proces_CO2T,\"#.##0,00\")),\nIF(Uit_Proces_CO2T<10,IF(Uit_Proces_CO2T<0.05,\"0,0\",TEXT(Uit_Proces_CO2T,\"#.##0,0\")),\nIF(Uit_Proces_CO2T<50,IF(Uit_Proces_CO2T<0.5,\"0\",TEXT(Uit_Proces_CO2T,\"#.##\")),\nIF(Uit_Proces_CO2T<0.5,\"0\",TEXT(Uit_Proces_CO2T,\"#.##\")))))","v":"1,4"},null,null,{"$f":"Uit_Proces_Verbrandingsmotor_CO2_Dim","v":"gCO2eq/MJ"},null,null,null,null,null,null,"CO2 Totaal",null,null,null,null,null,{"$f":"IF(Uit_Transport_CO2T<1,IF(Uit_Transport_CO2T<0.005,\"0,00\",TEXT(Uit_Transport_CO2T,\"#.##0,00\")),\nIF(Uit_Transport_CO2T<10,IF(Uit_Transport_CO2T<0.05,\"0,0\",TEXT(Uit_Transport_CO2T,\"#.##0,0\")),\nIF(Uit_Transport_CO2T<50,IF(Uit_Transport_CO2T<0.5,\"0\",TEXT(Uit_Transport_CO2T,\"#.##\")),\nIF(Uit_Transport_CO2T<0.5,\"0\",TEXT(Uit_Transport_CO2T,\"#.##\")))))","v":"0,30"},null,null,{"$f":"Uit_Transport_Verbrandingsmotor_CO2_Dim","v":"gCO2eq/MJ"}]
[]
[null,null,"© Dit rekenmodel is eigendom van KandT/Zilverberg. Er kunnen aan het gebruik van het rekenmodel geen rechten worden ontleend"]
[]
[]
[null,null,null,null,"Biomassa",null,null,null,null,null,{"$f":"Hout_Soort","v":"Loofhout mix NL"},null,null,null,null,null,null,null,null,null,"Biomassa",null,null,null,null,null,{"$f":"Hout_Soort","v":"Loofhout mix NL"},null,null,null,null,null,null,null,null,null,"Biomassa",null,null,null,null,null,{"$f":"Hout_Soort","v":"Loofhout mix NL"},null,null,null,null,null,null,null,null,null,null,null,null,null,null,null,null,null,null,null,null,null,null,null,null,null,null,null,null,null,null,null,null,null,{"$f":"SUM(M34:N36)","v":0},null,"gCO2/tonds"]
[null,null,null,null,"Vorm",null,null,null,null,null,{"$f":"Hout_Vorm","v":"Top- en takhout"},null,null,null,null,null,null,null,null,null,"Vorm",null,null,null,null,null,{"$f":"Proces_Vorm","v":"Chips G50/P31,5"},null,null,null,null,null,null,null,null,null,"Vorm",null,null,null,null,null,{"$f":"Transport_Vorm","v":"Chips G50/P31,5"},null,null,null,null,null,null,null,null,null,{"$f":"\"CO2 ter vergelijk voor: \"&Hout_Fossiel_Soort","v":"CO2 ter vergelijk voor: Aardgas"},null,null,null,null,null,{"$f":"IF(Uit_Hout_Fossiel_CO2<10,TEXT(Uit_Hout_Fossiel_CO2,\"#.##0,0\"),TEXT(Uit_Hout_Fossiel_CO2,\"#.##\"))","v":{"$error":"#REF!"}},null,null,"gCO2eq/MJ",null,null,null,null,null,null,null,null,null,null,null,null,null,null,null,null,"gCO2/tkm"]
[null,null,null,null,"Vulling (houtvolume in m3 per m3)",null,null,null,null,null,{"$f":"Hout_Vorm_Vulling","v":0.3},null,null,"m3/m3",null,null,null,null,null,null,"Vulling (houtvolume in m3 per m3)",null,null,null,null,null,{"$f":"Proces_Vorm_Vulling","v":0.33},null,null,"m3/m3",null,null,null,null,null,null,"Vulling (houtvolume in m3 per m3)",null,null,null,null,null,{"$f":"Transport_Vorm_Vulling","v":0.33},null,null,"m3/m3",null,null,null,null,null,null,null,null,null,null,null,null,null,null,null,null,null,null,null,null,null,null,null,null,null,null,null,null,null,null,null,null,"gCO2/MJ"]
[null,null,null,null,"Vochtigheid",null,null,null,null,null,{"$f":"Hout_Vochtigheid","v":50},null,null,"%",null,null,null,null,null,null,"Vochtigheid + Δ vochtigheid ",null,null,null,null,null,{"$f":"Proces_Vochtigheid","v":50},null,null,"%",null,null,null,null,null,null,"Vochtigheid + Δ vochtigheid ",null,null,null,null,null,{"$f":"Transport_Vochtigheid","v":50},null,null,"%"]
[null,null,null,null,null,null,null,null,null,null,null,null,null,null,null,null,null,null,null,null,"Verlies, vocht-vormverandering",null,null,null,null,null,{"$f":"IF(Uit_Proces_Doorzet_Verlies<10,TEXT(Uit_Proces_Doorzet_Verlies,\"#.##0,0\"),TEXT(Uit_Proces_Doorzet_Verlies,\"#.##\"))","v":{"$error":"#REF!"}},null,null,"m3",null,null,null,null,null,null,"Verlies, vocht-vormverandering",null,null,null,null,null,{"$f":"IF(Uit_Transport_Doorzet_Verlies<10,TEXT(Uit_Transport_Doorzet_Verlies,\"#.##0,0\"),TEXT(Uit_Transport_Doorzet_Verlies,\"#.##\"))","v":{"$error":"#REF!"}},null,null,"m3"]
[null,null,null,null,"Dichtheid massief",null,null,null,null,null,{"$f":"Hout_RHO_VF1","v":1071.0360000000001},null,null,"kg/m3",null,null,null,null,null,null,"Dichtheid massief",null,null,null,null,null,{"$f":"Proces_RHO_VF1","v":1071.0360000000001},null,null,"kg/m3",null,null,null,null,null,null,"Dichtheid massief",null,null,null,null,null,{"$f":"Transport_RHO_VF1","v":1071.0360000000001},null,null,"kg/m3"]
[null,null,null,null,"Dichtheid bij vorm",null,null,null,null,null,{"$f":"Hout_RHO","v":321.31080000000003},null,null,"kg/m3",null,null,null,null,null,null,"Dichtheid bij vorm",null,null,null,null,null,{"$f":"Proces_RHO","v":353.44188000000003},null,null,"kg/m3",null,null,null,null,null,null,"Dichtheid bij vorm",null,null,null,null,null,{"$f":"Transport_RHO","v":353.44188000000003},null,null,"kg/m3"]
[null,null,null,null,"LHV - volume",null,null,null,null,null,{"$f":"IF(Uit_Hout_LHVv<10,TEXT(Uit_Hout_LHVv,\"#.##0,0\"),TEXT(Uit_Hout_LHVv,\"#.##\"))","v":"0,9"},null,null,"MWh/m3",null,null,null,null,null,null,"LHV - volume",null,null,null,null,null,{"$f":"IF(Uit_Proces_LHVv<10,TEXT(Uit_Proces_LHVv,\"#.##0,0\"),TEXT(Uit_Proces_LHVv,\"#.##\"))","v":"3,4"},null,null,"GJ/m3",null,null,null,null,null,null,"LHV - volume",null,null,null,null,null,{"$f":"IF(Uit_Transport_LHVv<10,TEXT(Uit_Transport_LHVv,\"#.##0,0\"),TEXT(Uit_Transport_LHVv,\"#.##\"))","v":"3,4"},null,null,"GJ/m3"]
[null,null,null,null,"LHV - massa",null,null,null,null,null,{"$f":"IF(Uit_Hout_LHVm<10,TEXT(Uit_Hout_LHVm,\"#.##0,0\"),TEXT(Uit_Hout_LHVm,\"#.##\"))","v":"9,7"},null,null,"GJ/ton",null,null,null,null,null,null,"LHV - massa",null,null,null,null,null,{"$f":"IF(Uit_Proces_LHVm<10,TEXT(Uit_Proces_LHVm,\"#.##0,0\"),TEXT(Uit_Proces_LHVm,\"#.##\"))","v":"9,7"},null,null,"GJ/ton",null,null,null,null,null,null,"LHV - massa",null,null,null,null,null,{"$f":"IF(Uit_Transport_LHVm<10,TEXT(Uit_Transport_LHVm,\"#.##0,0\"),TEXT(Uit_Transport_LHVm,\"#.##\"))","v":"9,7"},null,null,"GJ/ton"]
[null,null,null,null,"Energieinhoud",null,null,null,null,null,{"$f":"IF(Uit_Hout_Doorzet_E<10,TEXT(Uit_Hout_Doorzet_E,\"#.##0,0\"),TEXT(Uit_Hout_Doorzet_E,\"#.##\"))","v":"34.803"},null,null,"GJ",null,null,null,null,null,null,"Energieinhoud",null,null,null,null,null,{"$f":"IF(Uit_Proces_Doorzet_E<10,TEXT(Uit_Proces_Doorzet_E,\"#.##0,0\"),TEXT(Uit_Proces_Doorzet_E,\"#.##\"))","v":{"$error":"#REF!"}},null,null,"GJ",null,null,null,null,null,null,"Energieinhoud",null,null,null,null,null,{"$f":"IF(Uit_Transport_Doorzet_E<10,TEXT(Uit_Transport_Doorzet_E,\"#.##0,0\"),TEXT(Uit_Transport_Doorzet_E,\"#.##\"))","v":{"$error":"#REF!"}},null,null,"GJ"]
[null,null,null,null,"Hoeveelheid  ",null,null,null,null,null,{"$f":"IF(Uit_Hout_Doorzet_MV<10,TEXT(Uit_Hout_Doorzet_MV,\"#.##0,0\"),TEXT(Uit_Hout_Doorzet_MV,\"#.##\"))","v":"3.607"},null,null,"ton",null,null,null,null,null,null,"Hoeveelheid  ",null,null,null,null,null,{"$f":"IF(Uit_Proces_Doorzet_MV<10,TEXT(Uit_Proces_Doorzet_MV,\"#.##0,0\"),TEXT(Uit_Proces_Doorzet_MV,\"#.##\"))","v":{"$error":"#REF!"}},null,null,"ton",null,null,null,null,null,null,"Hoeveelheid  ",null,null,null,null,null,{"$f":"IF(Uit_Transport_Doorzet_MV<10,TEXT(Uit_Transport_Doorzet_MV,\"#.##0,0\"),TEXT(Uit_Transport_Doorzet_MV,\"#.##\"))","v":{"$error":"#REF!"}},null,null,"m3"]
[null,null,null,null,"Energieinhoud/Hoeveelheid",null,null,null,null,null,{"$f":"IF(K63/K64<10,TEXT(K63/K64,\"#.##0,0\"),TEXT(K63/K64,\"#.##\"))","v":"9,6"},null,null,{"$f":"Uit_Hout_Doorzet_E_Dim&\"/\"&Uit_Hout_Doorzet_MV_Dim","v":"GJ/ton"},null,null,null,null,null,null,"Energieinhoud/Hoeveelheid",null,null,null,null,null,{"$f":"IF(AA63/AA64<10,TEXT(AA63/AA64,\"#.##0,0\"),TEXT(AA63/AA64,\"#.##\"))","v":{"$error":"#REF!"}},null,null,{"$f":"Uit_Hout_Doorzet_E_Dim&\"/\"&Uit_Hout_Doorzet_MV_Dim","v":"GJ/ton"},null,null,null,null,null,null,"Energieinhoud/Hoeveelheid",null,null,null,null,null,{"$f":"IF(AQ63/AQ64<10,TEXT(AQ63/AQ64,\"#.##0,0\"),TEXT(AQ63/AQ64,\"#.##\"))","v":{"$error":"#REF!"}},null,null,{"$f":"Uit_Hout_Doorzet_E_Dim&\"/\"&Uit_Hout_Doorzet_MV_Dim","v":"GJ/ton"}]
[null,null,null,null,"Hoeveelheid/Energieinhoud",null,null,null,null,null,{"$f":"IF(K64/K63<10,TEXT(K64/K63,\"#.##0,0\"),TEXT(K64/K63,\"#.##\"))","v":"0,1"},null,null,{"$f":"Uit_Hout_Doorzet_MV_Dim&\"/\"&Uit_Hout_Doorzet_E_Dim","v":"ton/GJ"},null,null,null,null,null,null,"Hoeveelheid/Energieinhoud",null,null,null,null,null,{"$f":"IF(AA64/AA63<10,TEXT(AA64/AA63,\"#.##0,0\"),TEXT(AA64/AA63,\"#.##\"))","v":{"$error":"#REF!"}},null,null,{"$f":"Uit_Hout_Doorzet_MV_Dim&\"/\"&Uit_Hout_Doorzet_E_Dim","v":"ton/GJ"},null,null,null,null,null,null,"Hoeveelheid/Energieinhoud",null,null,null,null,null,{"$f":"IF(AQ64/AQ63<10,TEXT(AQ64/AQ63,\"#.##0,0\"),TEXT(AQ64/AQ63,\"#.##\"))","v":{"$error":"#REF!"}},null,null,{"$f":"Uit_Hout_Doorzet_MV_Dim&\"/\"&Uit_Hout_Doorzet_E_Dim","v":"ton/GJ"}]

{"sheet":"Verklaring","index":5,"n_rows":36,"n_cols":12,"rows_kept":36,"cut":false,"hidden":false,"merged":[[7,2,8,6],[33,5,35,6],[23,3,23,4],[23,5,23,6]]}
[]
[null,null,"Algemene Vereniging Inlands Hout",null,null,null,"BedriijfsLogo"]
[null,null,"Kokermolen 11 "]
[null,null,"3994  DG Houten"]
[null,null,"Tel. 030 6930040"]
[null,null,"Email: info@avih.nl"]
[]
[null,null,{"$f":"Hout_Omschrijving","v":"Levering Biomassacentrale Texel"}]
[]
[]
[null,null,"Leveringsomvang"]
[null,null,"Oogstsmateriaal",{"$f":"Hout_Soort","v":"Loofhout mix NL"}]
[null,null,"Oogstvorm",{"$f":"Hout_Vorm","v":"Top- en takhout"},"Geleverd",{"$f":"Proces_Vorm","v":"Chips G50/P31,5"}]
[null,null,"Vochtigheid",{"$f":"Hout_Vochtigheid&\" %\"","v":"50 %"},"Vochtigheid",{"$f":"Transport_Vochtigheid&\" %\"","v":"50 %"},null,null,null,"Dimensie"]
[null,null,"Aangevoerd",{"$f":"IF(K15<1,IF(K15<0.005,\"0,00\",TEXT(K15,\"#.##0,00\")),\nIF(K15<10,IF(K15<0.05,\"0,0\",TEXT(K15,\"#.##0,0\")),\nIF(K15<50,IF(K15<0.5,\"0\",TEXT(K15,\"#.##\")),\nIF(K15<0.5,\"0\",TEXT(K15,\"#.##\")))))&\"  \"&J15","v":"3.607  ton"},"Hoeveelheid",{"$f":"IF(L15<1,IF(L15<0.005,\"0,00\",TEXT(L15,\"#.##0,00\")),\nIF(L15<10,IF(L15<0.05,\"0,0\",TEXT(L15,\"#.##0,0\")),\nIF(L15<50,IF(L15<0.5,\"0\",TEXT(L15,\"#.##\")),\nIF(L15<0.5,\"0\",TEXT(L15,\"#.##\")))))&\"  \"&J15","v":"3.534  ton"},null,null,null,"ton",{"$f":"IF(J15=\"m3\",Uit_Hout_Doorzet_m3,\nIF(J15=\"kg\",Uit_Hout_Doorzet_kg,\nIF(J15=\"kgds\",Uit_Hout_Doorzet_kgds,\nIF(J15=\"ton\",Uit_Hout_Doorzet_ton,\nIF(J15=\"tonds\",Uit_Hout_Doorzet_tonds,\nIF(J15=\"MJ\",Uit_Hout_Doorzet_MJ,\nIF(J15=\"GJ\",Uit_Hout_Doorzet_GJ,\nIF(J15=\"kWh\",Uit_Hout_Doorzet_kWh,\nIF(J15=\"MWh\",Uit_Hout_Doorzet_MWh,)))))))))","v":3606.5497959183667},{"$f":"IF(J15=\"m3\",Uit_Transport_Doorzet_m3,\nIF(J15=\"kg\",Uit_Transport_Doorzet_kg,\nIF(J15=\"kgds\",Uit_Transport_Doorzet_kgds,\nIF(J15=\"ton\",Uit_Transport_Doorzet_ton,\nIF(J15=\"tonds\",Uit_Transport_Doorzet_tonds,\nIF(J15=\"MJ\",Uit_Transport_Doorzet_MJ,\nIF(J15=\"GJ\",Uit_Transport_Doorzet_GJ,\nIF(J15=\"kWh\",Uit_Transport_Doorzet_kWh,\nIF(J15=\"MWh\",Uit_Transport_Doorzet_MWh,)))))))))","v":3534.4187999999999}]
[]
[null,null,"CO2 emissiefactoren","Proces/Transport","EU-dimensie"]
[null,null,"Proces",{"$f":"Proces_Omschrijving","v":"Chippen"},{"$f":"TEXT(Uit_Proces_Verbrandingsmotor_CO2T_g_MJ+Uit_Proces_Elektromotor_CO2T_g_MJ,\"#.##0,0\")&\"  gCO2eq/MJ\"","v":"1,1  gCO2eq/MJ"},{"$f":"IF(K18<1,IF(K18<0.005,\"0,00\",TEXT(K18,\"#.##0,00\")),\nIF(K18<10,IF(K18<0.05,\"0,0\",TEXT(K18,\"#.##0,0\")),\nIF(K18<50,IF(K18<0.5,\"0\",TEXT(K18,\"#.##\")),\nIF(K18<0.5,\"0\",TEXT(K18,\"#.##\")))))&\"  \"&J18","v":"21  kgCO2eq/tonds"},null,null,null,"kgCO2eq/tonds",{"$f":"IF(J18=\"gCO2eq/MJ\",(Uit_Proces_Verbrandingsmotor_CO2T_g_MJ+Uit_Proces_Elektromotor_CO2T_g_MJ),\nIF(J18=\"kgCO2eq/tonds\",(Uit_Proces_Verbrandingsmotor_CO2T_kg_tonds+Uit_Proces_Elektromotor_CO2T_kg_tonds),\nIF(J18=\"kgCO2eq\",(Uit_Proces_Verbrandingsmotor_CO2T_kg+Uit_Proces_Elektromotor_CO2T_kg),\nIF(J18=\"tonCO2eq\",(Uit_Proces_Verbrandingsmotor_CO2T_ton+Uit_Proces_Elektromotor_CO2T_ton),\nIF(J18=\"MtonCO2eq\",(Uit_Proces_Verbrandingsmotor_CO2T_Mton+Uit_Proces_Elektromotor_CO2T_Mton),)))))","v":21.460256672420272}]
[null,null,"Transport",{"$f":"Transport_Afstand&\" km enkele reis\"","v":"50 km enkele reis"},{"$f":"TEXT(Uit_Transport_Verbrandingsmotor_CO2T_g_MJ+Uit_Transport_Elektromotor_CO2T_g_MJ,\"#.##0,0\")&\"  gCO2eq/MJ\"","v":"0,3  gCO2eq/MJ"},{"$f":"IF(K19<1,IF(K19<0.005,\"0,00\",TEXT(K19,\"#.##0,00\")),\nIF(K19<10,IF(K19<0.05,\"0,0\",TEXT(K19,\"#.##0,0\")),\nIF(K19<50,IF(K19<0.5,\"0\",TEXT(K19,\"#.##\")),\nIF(K19<0.5,\"0\",TEXT(K19,\"#.##\")))))&\"  \"&J19","v":"0,28  gCO2eq/tkm"},null,null,null,"gCO2eq/tkm",{"$f":"IF(J19=\"gCO2eq/MJ\",(Uit_Transport_Verbrandingsmotor_CO2T_g_MJ+Uit_Transport_Elektromotor_CO2T_g_MJ),\nIF(J19=\"gCO2eq/tkm\",(Uit_Transport_Verbrandingsmotor_CO2T_g_tkm+Uit_Transport_Elektromotor_CO2T_g_tkm),\nIF(J19=\"kgCO2eq/tonds\",(Uit_Transport_Verbrandingsmotor_CO2T_kg_tonds+Uit_Transport_Elektromotor_CO2T_kg_tonds),\nIF(J19=\"kgCO2eq\",(Uit_Transport_Verbrandingsmotor_CO2T_kg+Uit_Transport_Elektromotor_CO2T_kg),\nIF(J19=\"tonCO2eq\",(Uit_Transport_Verbrandingsmotor_CO2T_ton+Uit_Transport_Elektromotor_CO2T_ton),\nIF(J19=\"MtonCO2eq\",(Uit_Transport_Verbrandingsmotor_CO2T_Mton+Uit_Transport_Elektromotor_CO2T_Mton),))))))","v":0.27719088924417595}]
[null,null,"Overige",null,{"$f":"TEXT(Uit_Proces_Basis_CO2T_g_MJ+Uit_Transport_Basis_CO2T_g_MJ,\"#.##0,0\")&\"  gCO2eq/MJ\"","v":"0,3  gCO2eq/MJ"},{"$f":"IF(K20<1,IF(K20<0.005,\"0,00\",TEXT(K20,\"#.##0,00\")),\nIF(K20<10,IF(K20<0.05,\"0,0\",TEXT(K20,\"#.##0,0\")),\nIF(K20<50,IF(K20<0.5,\"0\",TEXT(K20,\"#.##\")),\nIF(K20<0.5,\"0\",TEXT(K20,\"#.##\")))))&\"  \"&J20","v":"5,7  kgCO2eq/tonds"},null,null,null,"kgCO2eq/tonds",{"$f":"IF(J20=\"gCO2eq/MJ\",(Uit_Proces_Basis_CO2T_g_MJ+Uit_Transport_Basis_CO2T_g_MJ),\nIF(J20=\"kgCO2eq/tonds\",(Uit_Proces_Basis_CO2T_kg_tonds+Uit_Transport_Basis_CO2T_kg_tonds),\nIF(J20=\"kgCO2eq\",(Uit_Proces_Basis_CO2T_kg+Uit_Transport_Basis_CO2T_kg),\nIF(J20=\"tonCO2eq\",(Uit_Proces_Basis_CO2T_ton+Uit_Transport_Basis_CO2T_ton),\nIF(J20=\"tonCO2eq\",(Uit_Proces_Basis_CO2T_tonds+Uit_Transport_Basis_CO2T_tonds),)))))","v":5.6586389818886209}]
[null,null,"Totaal",null,{"$f":"TEXT(Uit_Proces_Verbrandingsmotor_CO2T_g_MJ+Uit_Proces_Elektromotor_CO2T_g_MJ+\nUit_Transport_Verbrandingsmotor_CO2T_g_MJ+Uit_Transport_Elektromotor_CO2T_g_MJ+\nUit_Proces_Basis_CO2T_g_MJ+Uit_Transport_Basis_CO2T_g_MJ,\"#.##0,0\")&\"  gCO2eq/MJ\"","v":"1,7  gCO2eq/MJ"},null,null,null,null,"gCO2eq/MJ",{"$f":"IF(J21=\"gCO2eq/MJ\",(Uit_Proces_Verbrandingsmotor_CO2T_g_MJ+Uit_Proces_Elektromotor_CO2T_g_MJ),\nIF(J21=\"kgCO2eq/ton\",(Uit_Proces_Verbrandingsmotor_CO2T_kg_tonds+Uit_Proces_Elektromotor_CO2T_kg_tonds),\nIF(J21=\"kgCO2eq\",(Uit_Proces_Verbrandingsmotor_CO2T_kg+Uit_Proces_Elektromotor_CO2T_kg),\nIF(J21=\"tonCO2eq\",(Uit_Proces_Verbrandingsmotor_CO2T_ton+Uit_Proces_Elektromotor_CO2T_ton),\nIF(J21=\"tonCO2eq\",(Uit_Proces_Verbrandingsmotor_CO2T_tonds+Uit_Proces_Elektromotor_CO2T_tonds),)))))","v":1.111930397534729}]
[]
[]
[null,null,"Vergelijkbare keten NL/EU",{"$f":"Hout_Keten_NL","v":"1a-Chips uit top- en tak hout uit bos of landschap"},null,{"$f":"Hout_Keten_EU","v":"1a-Woodchips from forest residues"}]
[null,null,null,null,"NL-keten1","EU-keten2"]
[null,null,"De CO2eq emissies","Proces",{"$f":"TEXT(Keten_NL_Proces_CO2,\"#.##0,0\")&\"  gCO2eq/MJ\"","v":"1,5  gCO2eq/MJ"},{"$f":"TEXT(Keten_EU_Proces_CO2,\"#.##0,0\")&\"  gCO2eq/MJ\"","v":"1,8  gCO2eq/MJ"}]
[null,null,null,"Transport",{"$f":"TEXT(Keten_NL_Transport_CO2,\"#.##0,0\")&\"  gCO2eq/MJ\"","v":"0,9  gCO2eq/MJ"},{"$f":"TEXT(Keten_EU_Transport_CO2,\"#.##0,0\")&\"  gCO2eq/MJ\"","v":"3,0  gCO2eq/MJ"}]
[null,null,null,"Totaal",{"$f":"TEXT(Keten_NL_Transport_CO2+Keten_NL_Proces_CO2,\"#.##0,0\")&\"  gCO2eq/MJ\"","v":"2,4  gCO2eq/MJ"},{"$f":"TEXT(Keten_EU_Transport_CO2+Keten_EU_Proces_CO2,\"#.##0,0\")&\"  gCO2eq/MJ\"","v":"4,8  gCO2eq/MJ"}]
[]
[null,null,"De NL-keten is gebaseerd op ","CO2 emissiefactoren voor Nederlandse houtige biobrandstoffen en -grondstoffen. "]
[null,null,null,"Rapport AVIH 2018"]
[null,null,"De EU-keten is gebaseerd op ","BioGrace-II / JRC"]
[]
[]
[null,null,"Datum:",{"$f":"TODAY()","v":"2018-03-28"}]
[null,null,"Plaats","Houten"]

{"sheet":"Details","index":6,"n_rows":76,"n_cols":9,"rows_kept":76,"cut":false,"hidden":false,"merged":[[8,1,9,5],[9,7,9,8],[8,7,8,8]]}
[]
[null,"Algemene Vereniging Inlands Hout",null,null,null,null,null,null,"BedriijfsLogo"]
[null,"Kokermolen 11 "]
[null,"3994  DG Houten"]
[null,"Tel. 030 6930040"]
[null,"Email: info@avih.nl"]
[]
[]
[null,{"$f":"Hout_Omschrijving","v":"Levering Biomassacentrale Texel"},null,null,null,null,{"$f":"\"Berekening:  \"","v":"Berekening:  "}]
[null,null,null,null,null,null,{"$f":"\"Datum:  \"","v":"Datum:  "},{"$f":"TODAY()","v":"2018-03-28"}]
[]
[]
[null,"Invoer","Biomassa","%","Proces","%","Transport","%","Dimensie"]
[null,"Houtsoort",{"$f":"Hout_Soort","v":"Loofhout mix NL"},null,{"$f":"Hout_Soort","v":"Loofhout mix NL"},null,{"$f":"Hout_Soort","v":"Loofhout mix NL"}]
[null,"Vorm",{"$f":"Hout_Vorm","v":"Top- en takhout"},null,{"$f":"Proces_Vorm","v":"Chips G50/P31,5"},null,{"$f":"Transport_Vorm","v":"Chips G50/P31,5"}]
[null,"Vochtigheid / vochtgehalte",{"$f":"Hout_Vochtigheid","v":50},null,{"$f":"Proces_Vochtigheid","v":50},null,{"$f":"Transport_Vochtigheid","v":50},null,"%"]
[null,"Doorzet",{"$f":"Uit_Hout_Doorzet_m3","v":11224.489795918365},{"$f":"C17/C17*100","v":100},{"$f":"Uit_Proces_Doorzet_m3","v":10000},{"$f":"E17/C17*100","v":89.090909090909108},{"$f":"Uit_Transport_Doorzet_m3","v":10000},{"$f":"G17/C17*100","v":89.090909090909108},"m3"]
[null,null,{"$f":"Uit_Hout_Doorzet_kg","v":3606549.7959183669},{"$f":"C18/C18*100","v":100},{"$f":"Uit_Proces_Doorzet_kg","v":3534418.8},{"$f":"E18/C18*100","v":98.000000000000014},{"$f":"Uit_Transport_Doorzet_kg","v":3534418.8},{"$f":"G18/C18*100","v":98.000000000000014},"kg"]
[null,null,{"$f":"Uit_Hout_Doorzet_kgds","v":1803274.8979591834},100,{"$f":"Uit_Proces_Doorzet_kgds","v":1767209.4},98.000000000000014,{"$f":"Uit_Transport_Doorzet_kgds","v":1767209.4},98.000000000000014,"kgds"]
[null,null,{"$f":"Uit_Hout_Doorzet_ton","v":3606.5497959183667},100,{"$f":"Uit_Proces_Doorzet_ton","v":3534.4187999999999},98.000000000000014,{"$f":"Uit_Transport_Doorzet_ton","v":3534.4187999999999},98.000000000000014,"ton"]
[null,null,{"$f":"Uit_Hout_Doorzet_tonds","v":1803.2748979591834},100,{"$f":"Uit_Proces_Doorzet_tonds","v":1767.2094},98.000000000000014,{"$f":"Uit_Transport_Doorzet_tonds","v":1767.2094},98.000000000000014,"tonds"]
[null,null,{"$f":"Uit_Hout_Doorzet_MJ","v":34803205.530612245},100,{"$f":"Uit_Proces_Doorzet_MJ","v":34107141.420000002},98.000000000000014,{"$f":"Uit_Transport_Doorzet_MJ","v":34107141.420000002},98.000000000000014,"MJ"]
[null,null,{"$f":"Uit_Hout_Doorzet_GJ","v":34803.205530612242},100,{"$f":"Uit_Proces_Doorzet_GJ","v":34107.14142},98.000000000000014,{"$f":"Uit_Transport_Doorzet_GJ","v":34107.14142},98.000000000000014,"GJ"]
[null,null,{"$f":"Uit_Hout_Doorzet_MWh","v":9667.5570918367339},100,{"$f":"Uit_Proces_Doorzet_MWh","v":9474.2059499999996},98,{"$f":"Uit_Transport_Doorzet_MWh","v":9474.2059499999996},98,"MWh"]
[null,null,{"$f":"Uit_Hout_Doorzet_kWh","v":9667557.0918367337},100,{"$f":"Uit_Proces_Doorzet_kWh","v":9474205.9499999993},98,{"$f":"Uit_Transport_Doorzet_kWh","v":9474205.9499999993},98,"kWh"]
[null,null,null,null,null,null,{"$f":"Uit_Transport_TonKilometer_tonkm","v":37376478.810000002},null,"tonkm"]
[]
[null,"Uitvoer","Biomassa",null,"Proces",null,"Transport",null,"Dimensie"]
[null,"Dichtheid massief",{"$f":"Hout_RHO_VF1","v":1071.0360000000001},null,{"$f":"Proces_RHO_VF1","v":1071.0360000000001},null,{"$f":"Transport_RHO_VF1","v":1071.0360000000001},null,"kg/m3"]
[null,"Vulling (houtvolume in m3 per m3)",{"$f":"Hout_Vorm_Vulling","v":0.3},null,{"$f":"Proces_Vorm_Vulling","v":0.33},null,{"$f":"Transport_Vorm_Vulling","v":0.33},null,"m3/m3"]
[null,"Dichtheid bij vorm",{"$f":"Hout_RHO","v":321.31080000000003},null,{"$f":"Proces_RHO","v":353.44188000000003},null,{"$f":"Transport_RHO","v":353.44188000000003},null,"kg/m3"]
[null,"LHV - volume",{"$f":"Uit_Hout_LHVv","v":0.86129145000000007},null,{"$f":"Uit_Proces_LHVv","v":3.4107141420000002},null,{"$f":"Uit_Transport_LHVv","v":3.4107141420000002},null,{"$f":"Hout_LHVv_Dim","v":"MWh/m3"}]
[null,"LHV - massa",{"$f":"Uit_Hout_LHVm","v":9.65},null,{"$f":"Uit_Proces_LHVm","v":9.65},null,{"$f":"Uit_Transport_LHVm","v":9.65},null,{"$f":"Hout_LHVm_Dim","v":"GJ/ton"}]
[null,"Energieinhoud",{"$f":"Uit_Hout_Doorzet_GJ","v":34803.205530612242},null,{"$f":"Uit_Proces_Doorzet_GJ","v":34107.14142},null,{"$f":"Uit_Transport_Doorzet_GJ","v":34107.14142},null,{"$f":"Uit_Hout_Doorzet_E_Dim","v":"GJ"}]
[null,"Hoeveelheid  ",{"$f":"Uit_Hout_Doorzet_ton","v":3606.5497959183667},null,{"$f":"Uit_Proces_Doorzet_ton","v":3534.4187999999999},null,{"$f":"Uit_Transport_Doorzet_ton","v":3534.4187999999999},null,{"$f":"Uit_Hout_Doorzet_MV_Dim","v":"ton"}]
[null,"Energieinhoud/Hoeveelheid",{"$f":"C34/C35","v":9.65},null,{"$f":"E34/E35","v":9.65},null,{"$f":"G34/G35","v":9.65},null,{"$f":"Uit_Hout_Doorzet_E_Dim&\"/\"&Uit_Hout_Doorzet_MV_Dim","v":"GJ/ton"}]
[null,"Hoeveelheid/Energieinhoud",{"$f":"C35/C34","v":0.10362694300518134},null,{"$f":"E35/E34","v":0.10362694300518134},null,{"$f":"G35/G34","v":0.10362694300518134},null,{"$f":"Uit_Hout_Doorzet_MV_Dim&\"/\"&Uit_Hout_Doorzet_E_Dim","v":"ton/GJ"}]
[]
[]
[null,"Invoer","Biomassa",null,"Proces",null,"Transport",null,"Dimensie"]
[null,"Omschrijving",null,null,{"$f":"Proces_Omschrijving","v":"Chippen"},null,{"$f":"Transport_Omschrijving","v":"Transport naar afnemer"}]
[null,"Houtvorm",{"$f":"Hout_Vorm","v":"Top- en takhout"},null,{"$f":"Proces_Vorm","v":"Chips G50/P31,5"},null,{"$f":"E42","v":"Chips G50/P31,5"}]
[null,"Houtverlies",0,null,{"$f":"Proces_Houtverlies","v":-2},null,{"$f":"Transport_Houtverlies","v":0},null,"%"]
[null,"Δ vochtigheid ",0,null,{"$f":"Proces_Delta_Vochtigheid","v":0},null,{"$f":"Transport_Delta_Vochtigheid","v":0},null,"%"]
[]
[null,"Afstand - enkele reis",null,null,null,null,{"$f":"Transport_Afstand","v":50},null,"km"]
[null,"Laadvermogen",null,null,null,null,{"$f":"Transport_Laadvermogen_ton","v":25},null,{"$f":"Transport_Laadvermogen_Dim","v":"ton"}]
[null,"Belading heen",null,null,null,null,{"$f":"Transport_Belading_Heen","v":100},null,"%"]
[null,"Snelheid",null,null,null,null,{"$f":"Transport_Snelheid_km_uur","v":55},null,"km/uur"]
[]
[null,"Aandrijving",null,null,{"$f":"IF(Proces_Verbrandingsmotor_Ja_Nee=\"Nee\",\"Geen aandrijving\",\"Verbrandingsmotor\")","v":"Verbrandingsmotor"},null,"Verbrandingsmotor"]
[null,"Werktuig / voertuig",null,null,{"$f":"Proces_Verbrandingsmotor_Type","v":"Chipper"},null,{"$f":"Transport_Verbrandingsmotor_Type","v":"Vrachtauto DAF 250"}]
[null,"Brandstof",null,null,{"$f":"Proces_Verbrandingsmotor_Brandstof","v":"EU-Diesel"},null,{"$f":"Transport_Verbrandingsmotor_Brandstof","v":"EU-Diesel"}]
[null,"Euronorm",null,null,{"$f":"Proces_Verbrandingsmotor_Euronorm","v":"Euro 5"},null,{"$f":"Transport_Verbrandingsmotor_Euronorm","v":"Euro 6"}]
[null,"Brandstofverbruik",null,null,{"$f":"Proces_Verbrandingsmotor_Verbruik&\"  \"&Proces_Verbrandingsmotor_Verbruik_Dim","v":"50  liter/uur"},null,{"$f":"Transport_Verbrandingsmotor_Verbruik&\"  \"&Transport_Verbrandingsmotor_Verbruik_Dim","v":"30  liter/100km"}]
[null,"Inzet Verbrandingsmotor",null,null,{"$f":"Proces_Verbrandingsmotor_Inzet&\"  \" &Proces_Verbrandingsmotor_Inzet_Dim","v":"50  m3/uur"}]
[null,"CO2 emissie",null,null,{"$f":"Uit_Proces_Verbrandingsmotor_CO2T_g_MJ","v":1.0747241132444871},null,{"$f":"Uit_Transport_Verbrandingsmotor_CO2T_g_MJ","v":0.30376100038934306},null,"gCO2eq/MJ"]
[null,"CO2 emissie",null,null,null,null,{"$f":"Uit_Transport_Verbrandingsmotor_CO2T_g_tkm","v":0.27719088924417595},null,"gCO2eq/tkm"]
[null,"CO2 emissie",null,null,{"$f":"Uit_Proces_Verbrandingsmotor_CO2T_kg","v":36655.767317913822},null,{"$f":"Uit_Transport_Verbrandingsmotor_CO2T_kg","v":10360.41939816},null,"kgCO2eq"]
[null,"CO2 emissie",null,null,{"$f":"Uit_Proces_Verbrandingsmotor_CO2T_kg_tonds","v":20.742175385618605},null,{"$f":"Uit_Transport_Verbrandingsmotor_CO2T_kg_tonds","v":5.862587307514322},null,"kgCO2eq/tonds"]
[null,"CO2 emissie",null,null,{"$f":"Uit_Proces_Verbrandingsmotor_CO2T_ton","v":36.655767317913821},null,{"$f":"Uit_Transport_Verbrandingsmotor_CO2T_ton","v":10.360419398159999},null,"tonCO2eq"]
[null,"CO2 emissie",null,null,{"$f":"Uit_Proces_Verbrandingsmotor_CO2T_Mton","v":3.6655767317913819E-2},null,{"$f":"Uit_Transport_Verbrandingsmotor_CO2T_Mton","v":1.0360419398159999E-2},null,"MtonCO2eq"]
[]
[null,"Aandrijving",null,null,{"$f":"IF(Proces_Elektromotor_Ja_Nee=\"Nee\",\"Geen elektrische aandrijving\",\"Elektromotor\")","v":"Elektromotor"},null,{"$f":"IF(Transport_Elektromotor_Ja_Nee=\"Nee\",\"Geen elektrische aandrijving\",\"Elektromotor\")","v":"Geen elektrische aandrijving"}]
[null,"Werktuig",null,null,{"$f":"Proces_Elektromotor_Werktuig","v":"Hulpaandrijving"},null,{"$f":"IF(Transport_Elektromotor_Ja_Nee=\"Nee\",\"\",Transport_Verbrandingsmotor_Type)","v":""}]
[null,"Stroombron",null,null,{"$f":"Proces_Elektromotor_Stroombron","v":"EU-Elektriciteit NL"},null,{"$f":"IF(Transport_Elektromotor_Ja_Nee=\"Nee\",\"\",Transport_Elektromotor_Stroombron)","v":""}]
[null,"Vermogen - Stroomverbruik",null,null,{"$f":"Proces_Elektromotor_VermogenVerbruik&\"  \"&Proces_Elektromotor_VermogenVerbruik_Dim","v":"2500  kWh"},null,{"$f":"Transport_Elektromotor_VermogenVerbruik&\"  \"&Transport_Elektromotor_VermogenVerbruik_Dim","v":"  "}]
[null,"Inzet Elektromotor",null,null,{"$f":"Proces_Elektromotor_Capaciteit&\"  \"&Proces_Elektromotor_Capaciteit_Dim","v":"50  m3/uur"}]
[null,"CO2 emissie",null,null,{"$f":"Uit_Proces_Elektromotor_CO2T_g_MJ","v":3.720628429024176E-2},null,{"$f":"Uit_Transport_Elektromotor_CO2T_g_MJ","v":0},null,"gCO2eq/MJ"]
[null,"CO2 emissie",null,null,null,null,{"$f":"Uit_Transport_Elektromotor_CO2T_g_tkm","v":0},null,"gCO2eq/tkm"]
[null,"CO2 emissie",null,null,{"$f":"Uit_Proces_Elektromotor_CO2T_kg","v":1269},null,{"$f":"Uit_Transport_Elektromotor_CO2T_kg","v":0},null,"kgCO2eq"]
[null,"CO2 emissie",null,null,{"$f":"Uit_Proces_Elektromotor_CO2T_kg_tonds","v":0.71808128680166594},null,{"$f":"Uit_Transport_Elektromotor_CO2T_kg_tonds","v":0},null,"kgCO2eq/tonds"]
[null,"CO2 emissie",null,null,{"$f":"Uit_Proces_Elektromotor_CO2T_ton","v":1.2689999999999999},null,{"$f":"Uit_Transport_Elektromotor_CO2T_ton","v":0},null,"tonCO2eq"]
[null,"CO2 emissie",null,null,{"$f":"Uit_Proces_Elektromotor_CO2T_Mton","v":1.2689999999999999E-3},null,{"$f":"Uit_Transport_Elektromotor_CO2T_Mton","v":0},null,"MtonCO2eq"]
[]
[null,"Totaal CO2eq",null,null,{"$f":"E57+E69","v":1.111930397534729},null,{"$f":"G57+G69","v":0.30376100038934306},null,"gCO2eq/MJ"]

{"sheet":"Blad1","index":7,"n_rows":0,"n_cols":0,"rows_kept":0,"cut":false,"hidden":true,"merged":[]}

{"sheet":"Invoer","index":8,"n_rows":68,"n_cols":25,"rows_kept":68,"cut":false,"hidden":true,"merged":[[3,24,3,25],[2,9,2,10],[2,12,2,13],[2,15,2,16],[2,18,2,19],[2,21,2,22],[2,24,2,25],[3,9,3,10],[3,12,3,13],[3,15,3,16],[3,18,3,19],[3,21,3,22]]}
[]
[null,null," = Invoergegeven"]
[null,null,null,null,null,null,null,null,null,"Stap 1",null,null,"Stap 2",null,null,"Stap 3",null,null,"Stap 4",null,null,"Stap 5",null,null,"Stap 6"]
[]
[]
[null,"Biomassa","Omschrijving",null,{"$f":"Hout_Omschrijving","v":"Levering Biomassacentrale Texel"}," "]
[null,null,"Houtsoort",null,{"$f":"Hout_Soort","v":"Loofhout mix NL"}]
[null,null,"Houtvorm",null,{"$f":"Hout_Vorm","v":"Top- en takhout"}]
[null,null,"Vochtigheid / vochtgehalte",null,{"$f":"Hout_Vochtigheid","v":50},"%"]
[null,null,"Hoeveelheid",null,{"$f":"Hout_Doorzet_Oogst_Eindgebruiker","v":10000},{"$f":"Hout_Doorzet_Dim","v":"m3"}]
[]
[null,"Keten","Keten-NL",null,{"$f":"Hout_Keten_NL","v":"1a-Chips uit top- en tak hout uit bos of landschap"}," "]
[null,null,"Detail ketenstap nummer",null,{"$f":"Hout_Keten_Stap_Detail_Nr","v":1}]
[null,null,"Dimensie keten CO2 emissie",null,{"$f":"Uit_NL_EU_Keten_CO2_Dim","v":"gCO2eq/MJ"}]
[]
[]
[null,"Proces","Opmerkingen",null,{"$f":"Proces_Opmerkingen","v":"Er wordt per keer zoveel gechipt als in de bunker past: 80/85 m3. Kosten 3 uur chipper 250 €/uur (veel kosten voor heen en weer rijden, vanwege kleine hoeveelheid)."}," "]
[null,null,"Omschrijving",null,{"$f":"Proces_Omschrijving","v":"Chippen"}]
[null,null,"Houtvorm proces",null,{"$f":"Proces_Vorm","v":"Chips G50/P31,5"}]
[null,null,"Verandering Houthoeveelheid",null,{"$f":"Proces_Houtverlies","v":-2},"%"]
[null,null,"Verandering Houtvochtigheid ",null,{"$f":"Proces_Delta_Vochtigheid","v":0},"%"]
[]
[null,null,"Gebruik verbrandings motor",null,"Ja"]
[null,null,"Werktuig",null,{"$f":"Proces_Verbrandingsmotor_Type","v":"Chipper"}]
[null,null,"Capaciteit werktuig",null,{"$f":"Proces_Verbrandingsmotor_Inzet","v":50},{"$f":"Proces_Verbrandingsmotor_Inzet_Dim","v":"m3/uur"}]
[null,null,"Stroombron",null,{"$f":"Proces_Verbrandingsmotor_Brandstof","v":"EU-Diesel"}]
[null,null,null,null,{"$f":"Proces_Verbrandingsmotor_Euronorm","v":"Euro 5"}]
[null,null,null,null,{"$f":"Proces_Verbrandingsmotor_Verbruik","v":50},{"$f":"Proces_Verbrandingsmotor_Verbruik_Dim","v":"liter/uur"}]
[]
[null,null,"Gebruik elektromotor",null,"Ja"]
[null,null,"Werktuig",null,{"$f":"Proces_Elektromotor_Werktuig","v":"Hulpaandrijving"}]
[null,null,"Capaciteit werktuig",null,{"$f":"Proces_EVerbrandingsmotor_Inzet","v":{"$error":"#NAME?"}},{"$f":"Proces_Verbrandingsmotor_Inzet_Dim","v":"m3/uur"}]
[null,null,"Brandstof",null,{"$f":"Proces_Verbrandingsmotor_Brandstof","v":"EU-Diesel"}]
[null,null,"Euronorm/Categorie",null,{"$f":"Proces_Verbrandingsmotor_Euronorm","v":"Euro 5"}]
[null,null,"Brandstofverbruik",null,{"$f":"Proces_Verbrandingsmotor_Verbruik","v":50},{"$f":"Proces_Verbrandingsmotor_Verbruik_Dim","v":"liter/uur"}]
[]
[null,null,"Basis CO2 productie",null,{"$f":"Proces_CO2_Productie_Basis","v":10000},{"$f":"Proces_CO2_Productie_Basis_Dim","v":"kgCO2eq"}]
[]
[null,null,"CO2 gebaseerd op ",null,{"$f":"Uit_Proces_Invoer_Uitvoer_Dim","v":"Uitvoer"}]
[]
[]
[]
[]
[]
[null,"Transport","Opmerkingen",null,{"$f":"Transport_Opmerkingen","v":"Vrachtwagens komen leeg terug"}]
[null,null,"Omschrijving",null,{"$f":"Transport_Omschrijving","v":"Transport naar afnemer"}]
[null,null,"Verandering Houthoeveelheid",null,{"$f":"Transport_Houtverlies","v":0},"%"]
[null,null,"Verandering Houtvochtigheid ",null,{"$f":"Transport_Delta_Vochtigheid","v":0},"%"]
[]
[null,null,"Afstand - enkele reis",null,{"$f":"Transport_Afstand","v":50},{"$f":"Transport_Afstand_Dim","v":"km"}]
[null,null,"Laadvermogen",null,{"$f":"Transport_Laadvermogen_ton","v":25},{"$f":"Transport_Laadvermogen_Dim","v":"ton"}]
[null,null,"Belading heen (terug = leeg)",null,{"$f":"Transport_Belading_Heen","v":100},"%"]
[null,null,"Snelheid",null,{"$f":"Transport_Snelheid_km_uur","v":55},"km/uur"]
[]
[]
[null,null,"Voertuig",null,{"$f":"Proces_Elektromotor_Werktuig","v":"Hulpaandrijving"}]
[null,null,"Brandstof",null,{"$f":"Transport_Verbrandingsmotor_Brandstof","v":"EU-Diesel"}]
[null,null,"Euronorm/Categorie",null,{"$f":"Proces_Verbrandingsmotor_Euronorm","v":"Euro 5"}]
[null,null,"Brandstofverbruik",null,{"$f":"Transport_Verbrandingsmotor_Verbruik","v":30},{"$f":"Transport_Verbrandingsmotor_Verbruik_Dim","v":"liter/100km"}]
[]
[null,null,"Gebruik elektromotor",null,"Ja"]
[null,null,"Voertuig",null,{"$f":"Transport_Elektromotor_Type","v":0}]
[null,null,"Brandstof",null,{"$f":"Transport_Verbrandingsmotor_Brandstof","v":"EU-Diesel"}]
[null,null,"Brandstofverbruik",null,{"$f":"Transport_Verbrandingsmotor_Verbruik","v":30},{"$f":"Transport_Verbrandingsmotor_Verbruik_Dim","v":"liter/100km"}]
[]
[null,null,"Basis CO2 productie",null,{"$f":"Transport_CO2_Productie_Basis","v":0},{"$f":"Transport_CO2_Productie_Basis_Dim","v":"gCO2eq/tkm"}]
[]
[null,null,"CO2 gebaseerd op ",null,{"$f":"Uit_Transport_Invoer_Uitvoer_Dim","v":"Uitvoer"}]

{"sheet":"1 Chips, top, tak","index":9,"n_rows":231,"n_cols":133,"rows_kept":231,"cut":false,"hidden":true,"merged":[[33,81,33,92],[33,69,33,80],[33,60,33,62],[35,109,35,112],[35,113,35,116],[35,96,38,97],[19,56,19,62],[19,66,19,68],[19,69,19,71],[33,96,33,97],[33,98,33,116],[36,98,36,100],[36,101,36,103],[36,104,36,108],[34,101,34,103],[34,104,34,108],[34,109,34,112],[34,96,34,99],[34,113,34,116],[36,109,36,112],[36,113,36,116],[37,98,37,100],[37,113,37,116],[37,104,37,108],[4,74,4,97],[5,51,5,62],[5,63,5,65],[5,66,5,68],[5,69,5,71],[5,74,5,85],[5,86,5,97],[6,63,6,65],[6,66,6,71],[8,69,8,71],[9,63,9,65],[26,63,26,66],[27,63,27,66],[1,24,2,35],[4,24,19,25],[4,51,4,62],[4,63,4,65],[4,66,4,71],[7,63,7,65],[15,63,15,65],[16,66,16,68],[1,50,2,71],[5,35,5,37],[5,38,5,40],[6,35,6,37],[14,69,14,71],[12,27,12,32],[10,35,12,40],[4,35,4,40],[18,35,18,40],[6,38,6,40],[14,66,14,68],[15,35,15,37],[89,28,89,29],[89,30,89,32],[90,28,90,29],[12,66,12,68],[12,69,12,71],[13,63,13,65],[28,63,28,66],[33,63,33,66],[35,60,35,62],[35,63,35,66],[34,63,34,66],[15,38,15,40],[14,51,14,62],[18,69,18,71],[12,51,12,62],[37,63,37,66],[39,63,39,66],[69,53,69,56],[70,53,70,56],[73,53,73,56],[71,53,71,56],[62,36,62,37],[62,38,62,40],[63,36,63,37],[37,101,37,103],[62,60,62,62],[62,63,62,66],[63,60,63,62],[63,63,63,66],[64,60,64,62],[92,57,92,59],[92,60,92,62],[121,71,121,73],[118,51,118,58],[118,59,118,60],[118,61,118,67],[118,68,118,70],[117,59,117,60],[119,68,119,70],[120,51,120,58],[120,59,120,60],[120,61,120,67],[39,60,39,62],[92,63,92,66],[57,60,57,62],[57,63,57,66],[46,60,46,62],[46,63,46,66],[119,61,119,67],[120,68,120,70],[100,60,100,62],[8,1,131,5],[8,7,8,10],[8,51,8,62],[8,66,8,68],[18,56,18,62],[18,66,18,68],[10,7,10,10],[10,51,10,62],[11,63,11,65],[12,7,12,10],[16,69,16,71],[17,66,17,68],[17,69,17,71],[82,60,82,62],[82,63,82,66],[69,60,69,62],[69,63,69,66],[37,60,37,62],[74,60,74,62],[91,28,91,29],[91,30,91,32],[39,96,44,97],[98,60,98,62],[88,57,88,59],[88,60,88,62],[88,63,88,66],[89,57,89,59],[56,60,56,62],[56,63,56,66],[52,60,52,62],[52,63,52,66],[34,69,46,80],[74,57,74,59],[75,57,75,59],[38,60,38,62],[38,63,38,66],[98,63,98,66],[64,63,64,66],[69,57,69,59],[73,57,73,59],[70,57,70,59],[62,57,62,59],[51,57,51,59],[39,113,39,116],[40,98,40,100],[40,101,40,103],[40,104,40,108],[40,109,40,112],[40,113,40,116],[41,113,41,116],[42,98,42,100],[42,101,42,103],[42,104,42,108],[42,109,42,112],[42,113,42,116],[39,98,39,100],[39,101,39,103],[39,104,39,108],[39,109,39,112],[137,7,144,12],[38,98,38,100],[38,101,38,103],[38,104,38,108],[38,109,38,112],[38,113,38,116],[87,53,87,56],[88,53,88,56],[89,53,89,56],[89,60,89,62],[89,63,89,66],[87,57,87,59],[87,60,87,62],[87,63,87,66],[91,53,91,56],[91,57,91,59],[91,60,91,62],[34,81,46,92],[35,98,35,100],[35,101,35,103],[35,104,35,108],[89,68,89,70],[91,68,91,70],[91,63,91,66],[195,86,195,92],[196,76,196,82],[196,84,196,85],[196,86,196,92],[193,76,193,82],[193,84,193,85],[193,86,193,92],[189,93,189,95],[189,96,189,98],[190,76,190,82],[190,84,190,85],[190,86,190,92],[190,96,190,98],[189,76,189,82],[189,84,189,85],[189,86,189,92],[193,96,193,98],[194,76,194,82],[194,84,194,85],[194,86,194,92],[194,96,194,98],[191,76,191,82],[191,86,191,92],[192,76,192,82],[196,100,196,102],[202,86,202,92],[202,93,202,95],[202,96,202,98],[202,100,209,112],[203,76,203,82],[203,84,203,85],[203,86,203,92],[203,93,203,95],[203,96,203,98],[206,76,206,82],[206,84,206,85],[206,86,206,92],[206,93,206,95],[210,100,210,102],[217,76,217,89],[204,76,204,82],[204,84,204,85],[204,86,204,92],[204,93,204,95],[204,96,204,98],[205,76,205,82],[205,84,205,85],[205,86,205,92],[205,93,205,95],[205,96,205,98],[221,86,221,92],[221,93,221,95],[221,96,221,98],[218,76,218,84],[219,84,219,85],[219,86,219,92],[219,93,219,95],[219,96,219,98],[220,76,220,82],[220,84,220,85],[220,86,220,92],[220,93,220,95],[226,86,226,92],[226,93,226,95],[226,96,226,98],[226,100,226,103],[224,76,224,82],[224,84,224,85],[224,86,224,92],[224,93,224,95],[225,76,225,82],[225,84,225,85],[225,86,225,92],[225,93,225,95],[219,100,225,112],[222,76,222,82],[222,84,222,85],[222,86,222,92],[222,93,222,95],[222,96,222,98],[223,76,223,82],[223,84,223,85],[223,86,223,92],[223,93,223,95],[220,96,220,98],[221,76,221,82],[229,86,229,92],[229,93,229,95],[112,51,112,104],[113,51,113,61],[227,76,227,82],[227,84,227,85],[227,86,227,92],[227,93,227,95],[227,96,227,98],[228,76,228,82],[228,84,228,85],[228,86,228,92],[228,93,228,95],[115,59,115,60],[115,61,115,67],[115,68,115,70],[115,75,123,87],[116,51,116,58],[116,59,116,60],[116,61,116,67],[116,68,116,70],[119,59,119,60],[226,76,226,82],[226,84,226,85],[229,76,229,82],[229,84,229,85],[221,84,221,85],[122,59,122,60],[122,61,122,67],[122,68,122,70],[191,84,191,85],[134,74,143,85],[123,51,123,58],[123,59,123,60],[123,61,123,67],[123,68,123,70],[123,71,123,72],[129,61,129,63],[195,76,195,82],[195,84,195,85],[185,76,185,129],[188,86,188,92],[188,93,188,95],[188,96,188,98],[188,100,195,112],[192,84,192,85],[192,86,192,92],[159,98,159,99],[37,109,37,112],[41,101,41,103],[41,104,41,108],[41,109,41,112],[93,57,93,59],[93,60,93,62],[93,63,93,66],[80,57,80,59],[80,60,80,62],[80,63,80,66],[81,57,81,59],[81,60,81,62],[81,63,81,66],[82,57,82,59],[44,60,44,62],[44,63,44,66],[45,57,45,59],[45,60,45,62],[45,63,45,66],[41,98,41,100],[71,57,71,59],[71,60,71,62],[43,104,43,108],[43,109,43,112],[43,113,43,116],[156,98,156,99],[157,98,157,99],[158,98,158,99],[121,98,121,99],[119,98,119,99],[123,98,123,99],[120,98,120,99],[116,98,116,99],[122,98,122,99],[44,113,44,116],[44,109,44,112],[44,104,44,108],[44,101,44,103],[44,98,44,100],[152,98,152,99],[155,98,155,99],[43,98,43,100],[43,101,43,103],[99,60,99,62],[98,57,98,59],[150,51,158,52],[145,55,145,58],[145,59,145,97],[146,55,146,58],[146,59,146,97],[144,51,144,54],[144,55,144,58],[144,59,144,97],[125,75,125,77],[134,86,143,97],[132,74,132,97],[129,64,129,67],[133,74,133,85],[128,64,128,67],[133,86,133,97],[128,61,128,63],[121,51,121,58],[117,68,117,70],[121,61,121,67],[121,59,121,60],[121,68,121,70],[117,61,117,67],[100,63,100,66],[99,63,99,66],[122,51,122,58],[71,28,71,29],[71,30,71,32],[72,28,72,29],[72,30,72,32],[73,28,73,29],[73,30,73,32],[71,35,73,40],[82,38,82,40],[89,35,91,40],[98,36,98,37],[98,38,98,40],[99,36,99,37],[99,38,99,40],[82,36,82,37],[71,63,71,66],[73,60,73,62],[90,30,90,32],[100,36,100,37],[100,38,100,40],[105,35,107,40],[99,57,99,59],[100,57,100,59],[91,46,91,48],[92,53,92,56],[93,53,93,56],[71,44,71,46],[71,47,71,48],[73,44,73,45],[73,46,73,48],[89,44,89,46],[89,47,89,48],[91,44,91,45],[63,38,63,40],[63,57,63,59],[64,36,64,37],[64,38,64,40],[64,57,64,59],[70,60,70,62],[70,63,70,66],[80,36,80,37],[80,38,80,40],[81,36,81,37],[81,38,81,40],[74,53,74,56],[75,53,75,56],[74,63,74,66],[73,63,73,66],[75,60,75,62],[75,63,75,66],[51,60,51,62],[51,63,51,66],[53,53,53,56],[53,57,53,59],[53,60,53,62],[53,63,53,66],[55,44,55,45],[55,46,55,48],[53,35,55,40],[53,44,53,46],[55,60,55,62],[55,63,55,66],[55,57,55,59],[53,47,53,48],[52,57,52,59],[51,53,51,56],[52,53,52,56],[54,28,54,29],[54,30,54,32],[57,53,57,56],[55,53,55,56],[57,57,57,59],[55,28,55,29],[55,30,55,32],[45,36,45,37],[45,38,45,40],[56,53,56,56],[56,57,56,59],[46,36,46,37],[46,38,46,40],[46,57,46,59],[53,28,53,29],[53,30,53,32],[44,36,44,37],[44,38,44,40],[34,53,34,56],[34,57,34,59],[34,60,34,62],[35,28,35,29],[35,30,35,32],[36,28,36,29],[36,30,36,32],[35,35,37,40],[35,44,35,46],[35,47,35,48],[35,53,35,56],[35,57,35,59],[37,28,37,29],[37,30,37,32],[44,57,44,59],[37,53,37,56],[37,57,37,59],[38,53,38,56],[38,57,38,59],[28,36,28,37],[37,44,37,45],[37,46,37,48],[39,53,39,56],[39,57,39,59],[28,38,28,40],[28,57,28,59],[28,60,28,62],[12,43,12,48],[17,35,17,40],[33,57,33,59],[33,53,33,56],[7,35,7,40],[16,35,16,37],[16,38,16,40],[26,36,26,37],[26,38,26,40],[26,57,26,59],[26,60,26,62],[27,36,27,37],[27,38,27,40],[27,57,27,59],[27,60,27,62]]}
[]
[null,"Keten",null,1,"Chips uit top en tak hout uit het bos",null,null,null,null,null,null,null,null,null,null,null,null,null,null,null,null,null,null,null,{"$f":"\"Keten - \"&'Ketens-Berekend'!E8","v":"Keten - 1a"},null,null,null,null,null,null,null,null,null,null,null,null,null,null,null,null,null,null,null,null,null,null,null,null,null,{"$f":"'Ketens-Berekend'!C8","v":"1a-Chips uit top- en tak hout uit bos of landschap"}]
[]
[null,"Omschrijving verschillen EU - NL",null,null,null,null,null,"Proces- en transportstappen",null,null,null,null,null,"Samenvatting CO2eq emissiefactoren"]
[null,null,null,null,null,null,null,null,null,null,null,null,null,"Proces",null,"JRC","JRC","NL",null,"Eenheid",null,null,null,null,"Samenvatting",null,null,null,null,null,null,null,null,null,null,"Bos of landschap",null,null,null,null,null,null,null,null,null,null,null,null,null,null,null,"Proces- en transportstappen",null,null,null,null,null,null,null,null,null,null,null,"Doorzet",null,null,"CO2eq-Emissies",null,null,null,null,null,null,null,"Toelichting"]
[null,null,null,null,null,null,null,null,null,null,null,null,null,null,null,null,null,null,null,null,null,null,null,null,null,null,null,null,null,null,null,null,null,null,null,"NL",null,null,{"$f":"Keten_EU","v":"EU"},null,null,null,null,null,null,null,null,null,null,null,null,null,null,null,null,null,null,null,null,null,null,null,null,null,null,null,"EU",null,null,"NL",null,null,null,null,"EU",null,null,null,null,null,null,null,null,null,null,null,"NL"]
[null,null,null,null,null,null,null,null,null,null,null,null,null,null,null,null,null,null,null,null,null,null,null,null,null,null,null,null,null,null,null,null,null,null,null,null,null,null,null,null,null,null,null,null,null,null,null,null,null,null,null,null,null,null,null,null,null,null,null,null,null,null,null,"MJ",null,null,"MJdiesel/MJhout"]
[null,null,null,null,null,null,null,null,null,null,null,null,null,null,null,null,null,null,null,null,null,null,null,null,null,null,null,null,null,null,null,null,null,null,null,"MJchips",null,null,null,null,null,null,null,null,null,null,null,null,null,null,null,null,null,null,null,null,null,null,null,null,null,null,"Biomassa uit bos of landschap",{"$f":"BL10","v":1.078947368421054}]
[null,"Hieronder staan ‘dataset’, proces- en transportstappen beschreven zoals erkend als representatief voor de Europese Unie (JRC 2014 en 2017). Dit is de 'typische' waarde voor Europa.\nDe 'typische' NL-praktijk verschilt hier: \nP1: er wordt niet gebundeld en er worden geen stobben geoogst. (JRC-waarde is voor NL aangehouden, vanwege onvoldoende data voor berekenen alternatief)\nP2: hout wordt meestal niet gedroogd langs de weg en vrijwel direct gechipt en met een vochtigheid (M45) aan de klant geleverd. (NL)\nT1: Transport is in een straal van maximaal 150 km met een walkingfloor trailer of containers (27 ton laadvermogen). (NL)",null,null,null,null,null,"P1 Inzamelen van top- en takhout",null,null,null,null,"P1","Inzamelen",null,{"$f":"E142*#REF!*#REF!","v":{"$error":"#REF!"}},{"$f":"E142*#REF!*#REF!","v":{"$error":"#REF!"}},{"$f":"Q9","v":{"$error":"#REF!"}},null,"kg/tonds chips",null,null,null,null,null,null,null,null,null,null,null,null,null,null,null,null,null,null,null,null,null,null,null,null,null,null,null,null,null,null,null,"P1 Inzamelen van top- en takhout",null,null,null,null,null,null,null,null,null,null,null,null,null,null,{"$f":"IF(BO7=\"kgCO2/tonds\",DF39*CP204*CP221)","v":false},null,null,{"$f":"DF45*CP204*CP221","v":14.775536842105282},null,null,null,null,null,null,null,null,null,null,null,null,null,null,null,null,null,null,null,null,null,null,null,null,null,null,null,null,null,null,null,null,null,null,null,null,null,null,null,null,null,null,null,null,null,null,null,null,null,null,null,null,null,null,null,null,null,null,null,null,null,null," "]
[null,null,null,null,null,null,null,null,null,null,null,null,null,null,null,null,null,null,null,null,null,null,null,null,null,null,null,null,null,null,null,null,null,null,null,null,null,null,null,null,null,null,null,null,null,null,null,null,null,null,null,null,null,null,null,null,null,null,null,null,null,null,null,{"$f":"BL12*CP204","v":1.078947368421054}]
[null,null,null,null,null,null,null,"P2 Drogen langs de weg",null,null,null,null,"P2","Opslag",null,null,null,null,null,"kg/tonds chips",null,null,null,null,null,null,null,"NL",null,null,null,null,null,null,null,{"$f":"'Ketens-Berekend'!C8","v":"1a-Chips uit top- en tak hout uit bos of landschap"},null,null,null,null,null,null,null,{"$f":"Keten_NL","v":{"$error":"#NAME?"}},null,null,null,null,null,null,null,"P2 Drogen langs de weg"]
[null,null,null,null,null,null,null,null,null,null,null,null,null,null,null,null,null,null,null,null,null,null,null,null,null,null,null,"EU",null,null,null,null,null,null,null,null,null,null,null,null,null,null,null,{"$f":"Keten_EU","v":"EU"},null,null,null,null,null,null,null,null,null,null,null,null,null,null,null,null,null,null,null,{"$f":"CP221","v":1.0249999999999999}]
[null,null,null,null,null,null,null,"P3 Chippen",null,null,null,null,"P3","Chippen",null,{"$f":"#REF!","v":{"$error":"#REF!"}},{"$f":"#REF!","v":{"$error":"#REF!"}},{"$f":"#REF!","v":{"$error":"#REF!"}},null,"kg/tonds chips",null,null,null,null,null,null,null,null,null,null,null,null,null,null,null,null,null,null,null,null,null,null,null,null,null,null,null,null,null,null,null,"P3 Chippen",null,null,null,null,null,null,null,null,null,null,null,null,null,null,{"$f":"CP226*CP221","v":6.2174073825000002},null,null,{"$f":"CP230*CP221","v":14.036759999999997}]
[null,null,null,null,null,null,null,null,null,null,null,null,null,"Subtotaal proces ",null,null,{"$f":"SUM(Q9:Q13)","v":{"$error":"#REF!"}},{"$f":"SUM(R9:R13)","v":{"$error":"#REF!"}},null,"kg/tonds chips",null,null,null,null,null,null,null,null,null,null,null,null,null,null,null,null,null,null,null,null,null,null,null,null,null,null,null,null,null,null,null,null,null,null,null,null,null,null,null,null,null,null,null,1]
[null,null,null,null,null,null,null,null,null,null,null,null,null,"Subtotaal proces ",null,null,{"$f":"E141*#REF!*#REF!+#REF!*#REF!","v":{"$error":"#REF!"}},{"$f":"Q15","v":{"$error":"#REF!"}},null,"g/MJchips",null,null,null,null,null,null,null,null,null,null,null,null,null,null,null,null,null,null,null,null,null,null,null,null,null,null,null,null,null,null,null,"T1 Transport chips naar afnemer",null,null,null,null,null,null,null,null,null,null,null,null,null,null,{"$f":"BQ118","v":57},null,null,{"$f":"BQ124","v":4.1256756756756756}]
[null,null,null,null,null,null,null,null,null,null,null,null,null,null,null,null,null,null,null,null,null,null,null,null,null,null,null,null,null,null,null,null,null,null,null,"NL",null,null,{"$f":"Keten_EU","v":"EU"},null,null,null,null,null,null,null,null,null,null,null,null,null,null,null,null,null,null,null,null,null,null,null,"Biomassa naar eindgebruiker",1]
[null,null,null,null,null,null,null,null,null,null,null,null,null,"Transport",null,"JRC-min","JRC-max","NL",null,null,null,null,null,null,null,null,null,null,null,null,null,null,null,null,null,null,null,null,null,null,null,null,null,null,null,null,null,null,null,null,null,"Totaal Processen",null,null,null,null,null,null,null,null,null,null,null,null,null,null,{"$f":"SUM(BO9:BQ13)","v":6.2174073825000002},null,null,{"$f":"SUM(BR9:BT13)","v":28.81229684210528}]
[null,null,null,null,null,null,null,"T1 Transport chips naar afnemer",null,null,null,null,"T1","Transport naar afnemer",null,{"$f":"#REF!","v":{"$error":"#REF!"}},{"$f":"#REF!","v":{"$error":"#REF!"}},{"$f":"#REF!","v":{"$error":"#REF!"}},null,"kg/tonds chips",null,null,null,null,null,null,null,null,null,null,null,null,null,null,null,"MJhout",null,null,null,null,null,null,null,null,null,null,null,null,null,null,null,"Totaal Transporten",null,null,null,null,null,null,null,null,null,null,null,null,null,null,{"$f":"BO15","v":57},null,null,{"$f":"BR15","v":4.1256756756756756}]
[null,null,null,null,null,null,null,null,null,null,null,null,null,null,null,null,null,null,null,null,null,null,null,null,null,null,null,null,null,null,null,null,null,null,null,"Eindverbruik",null,null,null,null,null,null,null,null,null,null,null,null,null,null,null,"Totaal",null,null,null,null,"kgCO2/tondschips",null,null,null,null,null,null,null,null,null,{"$f":"BO17+BO18","v":63.217407382499999},null,null,{"$f":"BR17+BR18","v":32.937972517780956}]
[null,null,null,null,null,null,null,null,null,null,null,null,null,null,null,null,null,null,null,null,null,null,null,null,null,null,null,null,null,null,null,null,null,null,null,null,null,null,null,null,null,null,null,null,null,null,null,null,null,null,null,"Totaal",null,null,null,null,"gCO2/MJchips",null,null,null,null,null,null,null,null,null,{"$f":"BO19/$CU$121","v":3.3272319674999999},null,null,{"$f":"BR19/$CU$121","v":1.7335775009358398}]
[]
[]
[]
[]
[]
[]
[null,null,null,null,null,null,null,null,null,null,null,null,null,null,null,null,null,null,null,null,null,null,null,null,null,null,null,null,null,null,null,null,null,null,null,"NL",30,null,1,null,null,null,null,null,null,null,null,null,null,null,null,null,null,null,null,null,null,"NL",null,null,"EU",null,null,"Eenheid"]
[null,null,null,null,null,null,null,null,null,null,null,null,null,null,null,null,null,null,null,null,null,null,null,null,null,null,null,null,null,null,null,null,null,null,null,{"$f":"Keten_EU","v":"EU"},30,null,1,null,null,null,null,null,null,null,null,null,null,null,null,null,null,"Houtdoorzet",null,null,null,1,null,null,1,null,null,"MJ"]
[null,null,null,null,null,null,null,null,null,null,null,null,null,null,null,null,null,null,null,null,null,null,null,null,null,null,null,null,null,null,null,null,null,null,null,null,"%",null,"m3",null,null,null,null,null,null,null,null,null,null,null,null,null,null,"Vochtigheid",null,null,null,45,null,null,30,null,null,"%"]
[]
[]
[]
[]
[null,null,null,null,null,null,null,null,null,null,null,null,null,null,null,null,null,null,null,null,null,null,null,null,null,null,null,null,null,null,null,null,null,null,null,null,null,null,null,null,null,null,null,null,null,null,null,null,null,null,null,null,null,null,null,null,null,"NL",null,null,"EU",null,null,"Eenheid",null,null,null,null,null,"EU",null,null,null,null,null,null,null,null,null,null,null,"NL",null,null,null,null,null,null,null,null,null,null,null,null,null,null,"P1",null,{"$f":"LOOKUP(AY2,Lijst_NL_Keten_Nr_Titel,Lijst_NL_Keten_Stap1_Titel)","v":{"$error":"#NAME?"}}]
[null,null,null,null,null,null,null,null,null,null,null,null,null,null,null,null,null,null,null,null,null,null,null,null,null,null,null,null,null,null,null,null,null,null,null,null,null,null,null,null,null,null,null,null,null,null,null,null,null,null,null,null,null,"Diesel",null,null,null,1,null,null,1,null,null,"MJ",null,null,null,null,null,"De data voor proces- en transportstappen zijn erkend als representatief voor de Europese Unie (JRC 2014 en 2017). \nDit is de 'typische' waarden voor Europa.",null,null,null,null,null,null,null,null,null,null,null,"P1: er wordt niet gebundeld en er worden geen stobben geoogst. (voor NL is de JRC waarde aangehouden, vanwege onvoldoende data voor het berekenen van de NL situatie)\nP2: hout wordt meestal niet gedroogd langs de weg en vrijwel direct gechipt en met een vochtigheid (M45) aan de klant geleverd. (NL)\nP3: In NL wordt vooral chipper met diesel langs de weg gechipt.\nT1: Transport is in een straal van maximaal 150 km met een walkingfloor trailer of 2 containers (27 ton laadvermogen). (NL)",null,null,null,null,null,null,null,null,null,null,null,null,null,null,null,null,null,null,null,"I/O",null,null,"Eenheid",null,null,null,null,"Waarde",null,null,null,"Bron"]
[null,null,null,null,null,null,null,null,null,null,null,null,null,null,null,null,null,null,null,null,null,null,null,null,null,null,null,{"$f":"Keten_NL","v":{"$error":"#NAME?"}},100,null,2.5,null,null,null,null,{"$f":"\"P1 - \"&\nLOOKUP(AY2,Lijst_NL_Keten_Nr_Titel,Lijst_NL_Keten_Stap1_Titel)","v":{"$error":"#NAME?"}},null,null,null,null,null,null,null,{"$f":"Keten_NL","v":{"$error":"#NAME?"}},null,null,null,null,null,null,null,null,null,"Afstand",null,null,null,120,null,null,500,null,null,"km",null,null,null,null,null,null,null,null,null,null,null,null,null,null,null,null,null,null,null,null,null,null,null,null,null,null,null,null,null,null,null,null,"EU",null,"Hout",null,null,"Input",null,null,"MJin/MJout",null,null,null,null,1,null,null,null,1]
[null,null,null,null,null,null,null,null,null,null,null,null,null,null,null,null,null,null,null,null,null,null,null,null,null,null,null,{"$f":"Keten_EU","v":"EU"},500,null,5,null,null,null,null,null,null,null,null,null,null,null,null,{"$f":"Keten_EU","v":"EU"},null,null,null,null,null,null,null,null,null,null,null,null,null,null,null,null,null,null,null,null,null,null,null,null,null,null,null,null,null,null,null,null,null,null,null,null,null,null,null,null,null,null,null,null,null,null,null,null,null,null,null,null,null,null,"Diesel",null,null,"Input",null,null,"MJ/MJhout",null,null,null,null,1.20221674876847E-2,null,null,null,1]
[null,null,null,null,null,null,null,null,null,null,null,null,null,null,null,null,null,null,null,null,null,null,null,null,null,null,null,{"$f":"Keten_NL","v":{"$error":"#NAME?"}},"km",null,"liter",null,null,null,null,null,null,null,null,null,null,null,null,{"$f":"Keten_NL","v":{"$error":"#NAME?"}},null,null,"gCO2/MJ",null,null,null,null,null,null,null,null,null,null,"NL",null,null,"EU",null,null,"Eenheid",null,null,null,null,null,null,null,null,null,null,null,null,null,null,null,null,null,null,null,null,null,null,null,null,null,null,null,null,null,null,null,null,null,null,"CO2",null,null,"Output",null,null,"gCOeq/Mjhout",null,null,null,null,{"$f":"CP190*$CU$117","v":1.1433081280788178}]
[null,null,null,null,null,null,null,null,null,null,null,null,null,null,null,null,null,null,null,null,null,null,null,null,null,null,null,null,null,null,null,null,null,null,null,null,null,null,null,null,null,null,null,null,null,null,null,null,null,null,null,null,null,"CO2",null,null,null,1,null,null,1,null,null,"MJ",null,null,null,null,null,null,null,null,null,null,null,null,null,null,null,null,null,null,null,null,null,null,null,null,null,null,null,null,null,null,null,null,null,null,"CO2",null,null,"Output",null,null,"kgCO2eq/tonds",null,null,null,null,{"$f":"DF38*$R$189","v":21.722854433497538}]
[null,null,null,null,null,null,null,null,null,null,null,null,null,null,null,null,null,null,null,null,null,null,null,null,null,null,null,null,null,null,null,null,null,null,null,null,null,null,null,null,null,null,null,null,null,null,null,null,null,null,null,null,null,"Afstand",null,null,null,120,null,null,500,null,null,"km",null,null,null,null,null,null,null,null,null,null,null,null,null,null,null,null,null,null,null,null,null,null,null,null,null,null,null,null,null,null,null,null,"NL",null,"Hout",null,null,"Input",null,null,"MJhout",null,null,null,null,1.20221674876847E-2,null,null,null,1]
[null,null,null,null,null,null,null,null,null,null,null,null,null,null,null,null,null,null,null,null,null,null,null,null,null,null,null,null,null,null,null,null,null,null,null,null,null,null,null,null,null,null,null,null,null,null,null,null,null,null,null,null,null,null,null,null,null,null,null,null,null,null,null,null,null,null,null,null,null,null,null,null,null,null,null,null,null,null,null,null,null,null,null,null,null,null,null,null,null,null,null,null,null,null,null,null,null,null,"Hout",null,null,"Output",null,null,"MJhout",null,null,null,null,1.20221674876847E-2,null,null,null,1]
[null,null,null,null,null,null,null,null,null,null,null,null,null,null,null,null,null,null,null,null,null,null,null,null,null,null,null,null,null,null,null,null,null,null,null,null,null,null,null,null,null,null,null,null,null,null,null,null,null,null,null,null,null,null,null,null,null,null,null,null,null,null,null,null,null,null,null,null,null,null,null,null,null,null,null,null,null,null,null,null,null,null,null,null,null,null,null,null,null,null,null,null,null,null,null,null,null,null,"Diesel",null,null,"Input",null,null,"MJ/MJhout",null,null,null,null,{"$f":"DF43*CU122/CU121/1000","v":7.5789473684210523E-3},null,null,null,2]
[null,null,null,null,null,null,null,null,null,null,null,null,null,null,null,null,null,null,null,null,null,null,null,null,null,null,null,null,null,null,null,null,null,null,null,null,null,null,null,null,null,null,null,null,null,null,null,null,null,null,null,null,null,null,null,null,null,null,null,null,null,null,null,null,null,null,null,null,null,null,null,null,null,null,null,null,null,null,null,null,null,null,null,null,null,null,null,null,null,null,null,null,null,null,null,null,null,null,"Diesel",null,null,"Input",null,null,"liter/tonds",null,null,null,null,4,null,null,null,2]
[null,null,null,null,null,null,null,null,null,null,null,null,null,null,null,null,null,null,null,null,null,null,null,null,null,null,null,null,null,null,null,null,null,null,null,null,null,null,null,null,null,null,null,null,null,null,null,null,null,null,null,null,null,null,null,null,null,null,null,null,null,null,null,null,null,null,null,null,null,null,null,null,null,null,null,null,null,null,null,null,null,null,null,null,null,null,null,null,null,null,null,null,null,null,null,null,null,null,"CO2",null,null,"Output",null,null,"gCOeq/Mjhout",null,null,null,null,{"$f":"DF42*$CU$117","v":0.72075789473684204}]
[null,null,null,null,null,null,null,null,null,null,null,null,null,null,null,null,null,null,null,null,null,null,null,null,null,null,null,null,null,null,null,null,null,null,null,"NL",30,null,1,null,null,null,null,null,null,null,null,null,null,null,null,null,null,null,null,null,null,"NL",null,null,"EU",null,null,"Eenheid",null,null,null,null,null,null,null,null,null,null,null,null,null,null,null,null,null,null,null,null,null,null,null,null,null,null,null,null,null,null,null,null,null,null,"CO2",null,null,"Output",null,null,"kgCO2eq/tonds",null,null,null,null,{"$f":"DF44*$R$189","v":13.694399999999998}]
[null,null,null,null,null,null,null,null,null,null,null,null,null,null,null,null,null,null,null,null,null,null,null,null,null,null,null,null,null,null,null,null,null,null,null,{"$f":"Keten_EU","v":"EU"},30,null,1,null,null,null,null,null,null,null,null,null,null,null,null,null,null,"Houtdoorzet",null,null,null,1,null,null,1,null,null,"MJ"]
[null,null,null,null,null,null,null,null,null,null,null,null,null,null,null,null,null,null,null,null,null,null,null,null,null,null,null,null,null,null,null,null,null,null,null,null,"%",null,"MJ",null,null,null,null,null,null,null,null,null,null,null,null,null,null,"Vochtigheid",null,null,null,45,null,null,30,null,null,"%"]
[]
[]
[]
[]
[null,null,null,null,null,null,null,null,null,null,null,null,null,null,null,null,null,null,null,null,null,null,null,null,null,null,null,null,null,null,null,null,null,null,null,null,null,null,null,null,null,null,null,null,null,null,null,null,null,null,null,null,null,null,null,null,null,"NL",null,null,"EU",null,null,"Eenheid"]
[null,null,null,null,null,null,null,null,null,null,null,null,null,null,null,null,null,null,null,null,null,null,null,null,null,null,null,null,null,null,null,null,null,null,null,null,null,null,null,null,null,null,null,null,null,null,null,null,null,null,null,null,null,"Diesel",null,null,null,1,null,null,1,null,null,"MJ"]
[null,null,null,null,null,null,null,null,null,null,null,null,null,null,null,null,null,null,null,null,null,null,null,null,null,null,null,{"$f":"Keten_NL","v":{"$error":"#NAME?"}},100,null,2.5,null,null,null,null,{"$f":"LOOKUP(AY2,Lijst_NL_Keten_Nr_Titel,Lijst_NL_Keten_Stap2_Titel)","v":{"$error":"#NAME?"}},null,null,null,null,null,null,null,{"$f":"Keten_NL","v":{"$error":"#NAME?"}},null,null,null,null,null,null,null,null,null,"Afstand",null,null,null,120,null,null,500,null,null,"km"]
[null,null,null,null,null,null,null,null,null,null,null,null,null,null,null,null,null,null,null,null,null,null,null,null,null,null,null,{"$f":"Keten_EU","v":"EU"},500,null,5,null,null,null,null,null,null,null,null,null,null,null,null,{"$f":"Keten_EU","v":"EU"}]
[null,null,null,null,null,null,null,null,null,null,null,null,null,null,null,null,null,null,null,null,null,null,null,null,null,null,null,{"$f":"Keten_NL","v":{"$error":"#NAME?"}},"km",null,"liter",null,null,null,null,null,null,null,null,null,null,null,null,null,"liter",null,"gCO2/MJ",null,null,null,null,null,null,null,null,null,null,"NL",null,null,"EU",null,null,"Eenheid"]
[null,null,null,null,null,null,null,null,null,null,null,null,null,null,null,null,null,null,null,null,null,null,null,null,null,null,null,null,null,null,null,null,null,null,null,null,null,null,null,null,null,null,null,null,null,null,null,null,null,null,null,null,null,"CO2",null,null,null,1,null,null,1,null,null,"MJ"]
[null,null,null,null,null,null,null,null,null,null,null,null,null,null,null,null,null,null,null,null,null,null,null,null,null,null,null,null,null,null,null,null,null,null,null,null,null,null,null,null,null,null,null,null,null,null,null,null,null,null,null,null,null,"Afstand",null,null,null,120,null,null,500,null,null,"km"]
[]
[]
[]
[]
[null,null,null,null,null,null,null,null,null,null,null,null,null,null,null,null,null,null,null,null,null,null,null,null,null,null,null,null,null,null,null,null,null,null,null,"NL",{"$f":"BI65","v":30},null,{"$f":"IF(AM65=\"MJ\",BF64,\nIF(AM65=\"kg\",BF64/JRC_Basis_Hout_LHVm/(100-BF65)*100,\nIF(AM65=\"kgds\",BF64/JRC_Basis_Hout_LHVm,\nIF(AM65=\"kWh\",BF64/3.6,FALSE))))","v":1.0249999999999999},null,null,null,null,null,null,null,null,null,null,null,null,null,null,null,null,null,null,"NL",null,null,"EU",null,null,"Eenheid"]
[null,null,null,null,null,null,null,null,null,null,null,null,null,null,null,null,null,null,null,null,null,null,null,null,null,null,null,null,null,null,null,null,null,null,null,{"$f":"Keten_EU","v":"EU"},30,null,{"$f":"IF(AM65=\"MJ\",BI64,\nIF(AM65=\"kg\",BI64/JRC_Basis_Hout_LHVm/(100-BF65)*100,\nIF(AM65=\"kgds\",BI64/JRC_Basis_Hout_LHVm,\nIF(AM65=\"kWh\",BI64/3.6,FALSE))))","v":1.0249999999999999},null,null,null,null,null,null,null,null,null,null,null,null,null,null,"Houtdoorzet",null,null,null,1.0249999999999999,null,null,1.0249999999999999,null,null,"MJ"]
[null,null,null,null,null,null,null,null,null,null,null,null,null,null,null,null,null,null,null,null,null,null,null,null,null,null,null,null,null,null,null,null,null,null,null,null,"%",null,"MJ",null,null,null,null,null,null,null,null,null,null,null,null,null,null,"Vochtigheid",null,null,null,45,null,null,30,null,null,"%"]
[]
[]
[]
[]
[null,null,null,null,null,null,null,null,null,null,null,null,null,null,null,null,null,null,null,null,null,null,null,null,null,null,null,null,null,null,null,null,null,null,null,null,null,null,null,null,null,null,null,null,null,null,null,null,null,null,null,null,null,null,null,null,null,"NL",null,null,"EU",null,null,"Eenheid"]
[null,null,null,null,null,null,null,null,null,null,null,null,null,null,null,null,null,null,null,null,null,null,null,null,null,null,null,null,null,null,null,null,null,null,null,null,null,null,null,null,null,null,null,null,null,null,null,null,null,null,null,null,null,"Diesel",null,null,null,1,null,null,1,null,null,"MJ"]
[null,null,null,null,null,null,null,null,null,null,null,null,null,null,null,null,null,null,null,null,null,null,null,null,null,null,null,{"$f":"Keten_NL","v":{"$error":"#NAME?"}},100,null,2.5,null,null,null,null,{"$f":"LOOKUP(AY2,Lijst_NL_Keten_Nr_Titel,Lijst_NL_Keten_Stap3_Titel)","v":{"$error":"#NAME?"}},null,null,null,null,null,null,null,{"$f":"Keten_NL","v":{"$error":"#NAME?"}},null,null,null,null,null,null,null,null,null,"Afstand",null,null,null,120,null,null,500,null,null,"km"]
[null,null,null,null,null,null,null,null,null,null,null,null,null,null,null,null,null,null,null,null,null,null,null,null,null,null,null,{"$f":"Keten_EU","v":"EU"},500,null,5,null,null,null,null,null,null,null,null,null,null,null,null,{"$f":"Keten_EU","v":"EU"}]
[null,null,null,null,null,null,null,null,null,null,null,null,null,null,null,null,null,null,null,null,null,null,null,null,null,null,null,{"$f":"Keten_NL","v":{"$error":"#NAME?"}},"km",null,"liter",null,null,null,null,null,null,null,null,null,null,null,null,{"$f":"Keten_NL","v":{"$error":"#NAME?"}},"liter",null,"gCO2/MJ",null,null,null,null,null,null,null,null,null,null,"NL",null,null,"EU",null,null,"Eenheid"]
[null,null,null,null,null,null,null,null,null,null,null,null,null,null,null,null,null,null,null,null,null,null,null,null,null,null,null,null,null,null,null,null,null,null,null,null,null,null,null,null,null,null,null,null,null,null,null,null,null,null,null,null,null,"CO2",null,null,null,1,null,null,1,null,null,"MJ"]
[null,null,null,null,null,null,null,null,null,null,null,null,null,null,null,null,null,null,null,null,null,null,null,null,null,null,null,null,null,null,null,null,null,null,null,null,null,null,null,null,null,null,null,null,null,null,null,null,null,null,null,null,null,"Afstand",null,null,null,120,null,null,500,null,null,"km"]
[]
[]
[]
[]
[null,null,null,null,null,null,null,null,null,null,null,null,null,null,null,null,null,null,null,null,null,null,null,null,null,null,null,null,null,null,null,null,null,null,null,"NL",30,null,{"$f":"IF(AM83=\"MJ\",BF82,\nIF(AM83=\"kg\",BF82/JRC_Basis_Hout_LHVm/(100-BF83)*100,\nIF(AM83=\"kgds\",BF82/JRC_Basis_Hout_LHVm,\nIF(AM83=\"kWh\",BF82/3.6,FALSE))))","v":1},null,null,null,null,null,null,null,null,null,null,null,null,null,null,null,null,null,null,"NL",null,null,"EU",null,null,"Eenheid"]
[null,null,null,null,null,null,null,null,null,null,null,null,null,null,null,null,null,null,null,null,null,null,null,null,null,null,null,null,null,null,null,null,null,null,null,{"$f":"Keten_EU","v":"EU"},30,null,{"$f":"IF(AM83=\"MJ\",BI82,\nIF(AM83=\"kg\",BI82/JRC_Basis_Hout_LHVm/(100-BF83)*100,\nIF(AM83=\"kgds\",BI82/JRC_Basis_Hout_LHVm,\nIF(AM83=\"kWh\",BI82/3.6,FALSE))))","v":1},null,null,null,null,null,null,null,null,null,null,null,null,null,null,"Houtdoorzet",null,null,null,1,null,null,1,null,null,"MJ"]
[null,null,null,null,null,null,null,null,null,null,null,null,null,null,null,null,null,null,null,null,null,null,null,null,null,null,null,null,null,null,null,null,null,null,null,null,"%",null,"MJ",null,null,null,null,null,null,null,null,null,null,null,null,null,null,"Vochtigheid",null,null,null,45,null,null,30,null,null,"%"]
[]
[]
[]
[]
[null,null,null,null,null,null,null,null,null,null,null,null,null,null,null,null,null,null,null,null,null,null,null,null,null,null,null,null,null,null,null,null,null,null,null,null,null,null,null,null,null,null,null,null,null,null,null,null,null,null,null,null,null,null,null,null,null,"NL",null,null,"EU",null,null,"Eenheid"]
[null,null,null,null,null,null,null,null,null,null,null,null,null,null,null,null,null,null,null,null,null,null,null,null,null,null,null,null,null,null,null,null,null,null,null,null,null,null,null,null,null,null,null,null,null,null,null,null,null,null,null,null,null,"Diesel",null,null,null,1,null,null,3.3570000000000002E-3,null,null,"MJ/MJchips"]
[null,null,null,null,null,null,null,null,null,null,null,null,null,null,null,null,null,null,null,null,null,null,null,null,null,null,null,{"$f":"Keten_NL","v":{"$error":"#NAME?"}},100,null,2.5,null,null,null,null,{"$f":"LOOKUP(AY2,Lijst_NL_Keten_Nr_Titel,Lijst_NL_Keten_Stap4_Titel)","v":{"$error":"#NAME?"}},null,null,null,null,null,null,null,{"$f":"Keten_NL","v":{"$error":"#NAME?"}},null,null,null,null,null,null,null,null,null,"Afstand",null,null,null,120,null,null,500,null,null,"km"]
[null,null,null,null,null,null,null,null,null,null,null,null,null,null,null,null,null,null,null,null,null,null,null,null,null,null,null,{"$f":"Keten_EU","v":"EU"},500,null,5,null,null,null,null,null,null,null,null,null,null,null,null,{"$f":"Keten_EU","v":"EU"}]
[null,null,null,null,null,null,null,null,null,null,null,null,null,null,null,null,null,null,null,null,null,null,null,null,null,null,null,{"$f":"Keten_NL","v":{"$error":"#NAME?"}},"km",null,"liter",null,null,null,null,null,null,null,null,null,null,null,null,{"$f":"Keten_NL","v":{"$error":"#NAME?"}},"liter",null,"gCO2/MJ",null,null,null,null,null,null,null,null,null,null,"NL",null,null,"EU",null,null,"Eenheid"]
[null,null,null,null,null,null,null,null,null,null,null,null,null,null,null,null,null,null,null,null,null,null,null,null,null,null,null,null,null,null,null,null,null,null,null,null,null,null,null,null,null,null,null,null,null,null,null,null,null,null,null,null,null,"CO2",null,null,null,1,null,null,1,null,null,"MJ"]
[null,null,null,null,null,null,null,null,null,null,null,null,null,null,null,null,null,null,null,null,null,null,null,null,null,null,null,null,null,null,null,null,null,null,null,null,null,null,null,null,null,null,null,null,null,null,null,null,null,null,null,null,null,"Afstand",null,null,null,120,null,null,500,null,null,"km"]
[]
[]
[]
[]
[null,null,null,null,null,null,null,null,null,null,null,null,null,null,null,null,null,null,null,null,null,null,null,null,null,null,null,null,null,null,null,null,null,null,null,"NL",30,null,{"$f":"IF(AM101=\"MJ\",BF100,\nIF(AM101=\"kg\",BF100/JRC_Basis_Hout_LHVm/(100-BF101)*100,\nIF(AM101=\"kgds\",BF100/JRC_Basis_Hout_LHVm,\nIF(AM101=\"kWh\",BF100/3.6,FALSE))))","v":1},null,null,null,null,null,null,null,null,null,null,null,null,null,null,null,null,null,null,"NL",null,null,"EU",null,null,"Eenheid"]
[null,null,null,null,null,null,null,null,null,null,null,null,null,null,null,null,null,null,null,null,null,null,null,null,null,null,null,null,null,null,null,null,null,null,null,{"$f":"Keten_EU","v":"EU"},30,null,{"$f":"IF(AM101=\"MJ\",BI100,\nIF(AM101=\"kg\",BI100/JRC_Basis_Hout_LHVm/(100-BF101)*100,\nIF(AM101=\"kgds\",BI100/JRC_Basis_Hout_LHVm,\nIF(AM101=\"kWh\",BI100/3.6,FALSE))))","v":1},null,null,null,null,null,null,null,null,null,null,null,null,null,null,"Houtdoorzet",null,null,null,1,null,null,1,null,null,"MJ"]
[null,null,null,null,null,null,null,null,null,null,null,null,null,null,null,null,null,null,null,null,null,null,null,null,null,null,null,null,null,null,null,null,null,null,null,null,"%",null,"MJ",null,null,null,null,null,null,null,null,null,null,null,null,null,null,"Vochtigheid",null,null,null,45,null,null,30,null,null,"%"]
[]
[]
[]
[]
[null,null,null,null,null,null,null,null,null,null,null,null,null,null,null,null,null,null,null,null,null,null,null,null,null,null,null,null,null,null,null,null,null,null,null,"Eindgebruiker"]
[]
[]
[]
[]
[]
[]
[null,null,null,null,null,null,null,null,null,null,null,null,null,null,null,null,null,null,null,null,null,null,null,null,null,null,null,null,null,null,null,null,null,null,null,null,null,null,null,null,null,null,null,null,null,null,null,null,null,null,null,"Transportstappen"]
[null,null,null,null,null,null,null,null,null,null,null,null,null,null,null,null,null,null,null,null,null,null,null,null,null,null,null,null,null,null,null,null,null,null,null,null,null,null,null,null,null,null,null,null,null,null,null,null,null,null,null,"T1 Transport van chips naar de afnemer"]
[null,null,null,null,null,null,null,null,null,null,null,null,null,null,null,null,null,null,null,null,null,null,null,null,null,null,null,null,null,null,null,null,null,null,null,null,null,null,null,null,null,null,null,null,null,null,null,null,null,null,null,"T1 Transport van chips naar de afnemer",null,null,null,null,null,null,null,null,null,null,null,null,null,null,null,null,null,null,null,null,null,null,null,"Omschrijving JRC"]
[null,null,null,null,null,null,null,null,null,null,null,null,null,null,null,null,null,null,null,null,null,null,null,null,null,null,null,null,null,null,null,null,null,null,null,null,null,null,null,null,null,null,null,null,null,null,null,null,null,null,null,null,null,null,null,null,null,null,null,"I/O",null,"Eenheid",null,null,null,null,null,null,"Aantal",null,null,"Omschrijving",null,null,null,"JRC: De vochtigheid voor het Europees gemiddelde (JRC)  is nog steeds aangenomen op 30 %.\nJRC min = 1-500 km = 500 km truck\nJRC max = boven 10.000 km = 100 km truck, 750 km train, 16.500 km bulk carrier\n\nNL: De vochtigheid van de NL chips is aangenomen op 45 %. De gemiddelde straal in NL voor afnemers van NL houtige biomassa is maximaal 100 km.  Voor een truck van 40 ton, payload 27 ton chips is het verbruik diesel is 30,53 liter per 100 km, inclusief lege terugrit (dataset JRC 2017). Met vochtigheid M45  is dit 14,8 ton droge stof.  Verbruik diesel is 30,53 liter/14,8 ton droge stof = 2,06 liter/ton droge stof",null,null,null,null,null,null,null,null,null,null,null,null,null,null,null,"CO2 emissiefactoren JRC 2017"]
[null,null,null,null,null,null,null,null,null,null,null,null,null,null,null,null,null,null,null,null,null,null,null,null,null,null,null,null,null,null,null,null,null,null,null,null,null,null,null,null,null,null,null,null,null,null,null,null,null,null,null,"CO2 ",null,null,null,null,null,null,null,"Output",null,"g/MJchips",null,null,null,null,null,null,3,null,null,"1-500 km",null,null,null,null,null,null,null,null,null,null,null,null,null,null,null,null,null,null,null,"EU Diesel WTW",null,null,null,null,null,null,95.1,null,null,"gCO2 / MJdiesel"]
[null,null,null,null,null,null,null,null,null,null,null,null,null,null,null,null,null,null,null,null,null,null,null,null,null,null,null,null,null,null,null,null,null,null,null,null,null,null,null,null,null,null,null,null,null,null,null,null,null,null,null,null,null,null,null,null,null,null,null,"Output",null,"kg/tonds chi",null,null,null,null,null,null,{"$f":"BQ117*$CU$121","v":57}]
[null,null,null,null,null,null,null,null,null,null,null,null,null,null,null,null,null,null,null,null,null,null,null,null,null,null,null,null,null,null,null,null,null,null,null,null,null,null,null,null,null,null,null,null,null,null,null,null,null,null,null,"CO2",null,null,null,null,null,null,null,"Output",null,"g/MJchips",null,null,null,null,null,null,20.5,null,null,"boven 10.000 km",null,null,null,null,null,null,null,null,null,null,null,null,null,null,null,null,null,null,null,"Gebruikte aannames algemeen JRC 2017"]
[null,null,null,null,null,null,null,null,null,null,null,null,null,null,null,null,null,null,null,null,null,null,null,null,null,null,null,null,null,null,null,null,null,null,null,null,null,null,null,null,null,null,null,null,null,null,null,null,null,null,null,null,null,null,null,null,null,null,null,"Output",null,"kg/tonds chi",null,null,null,null,null,null,{"$f":"BQ119*$CU$121","v":389.5},null,null,null,null,null,null,null,null,null,null,null,null,null,null,null,null,null,null,null,null,null,null,"Dichtheid hout (fijnspar)",null,null,null,null,null,null,425,null,null,"kgdroge stof/m3"]
[null,null,null,null,null,null,null,null,null,null,null,null,null,null,null,null,null,null,null,null,null,null,null,null,null,null,null,null,null,null,null,null,null,null,null,null,null,null,null,null,null,null,null,null,null,null,null,null,null,null,null,"Diesel NL",null,null,null,null,null,null,null,"Input",null,"MJ/MJhout",null,null,null,null,null,null,{"$f":"BQ122*CU122/CU121/1000","v":3.9031578947368419E-3},null,null,null,3,null,null,null,null,null,null,null,null,null,null,null,null,null,null,null,null,null,null,"Energiewaarde hout",null,null,null,null,null,null,19,null,null,"MJ/kgdroge stof"]
[null,null,null,null,null,null,null,null,null,null,null,null,null,null,null,null,null,null,null,null,null,null,null,null,null,null,null,null,null,null,null,null,null,null,null,null,null,null,null,null,null,null,null,null,null,null,null,null,null,null,null,"Diesel NL",null,null,null,null,null,null,null,"Input",null,"liter/tonds",null,null,null,null,null,null,2.06,null,null,3,null,null,null,null,null,null,null,null,null,null,null,null,null,null,null,null,null,null,null,"Energiewaarde diesel",null,null,null,null,null,null,36,null,null,"MJ/liter"]
[null,null,null,null,null,null,null,null,null,null,null,null,null,null,null,null,null,null,null,null,null,null,null,null,null,null,null,null,null,null,null,null,null,null,null,null,null,null,null,null,null,null,null,null,null,null,null,null,null,null,null,"CO2-NL",null,null,null,null,null,null,null,"Output",null,"g/MJchips",null,null,null,null,null,null,{"$f":"BQ124/$CU$121","v":0.21714082503556187},null,null,"straal maximaal ",null,null,null,null,null,null,null,null,null,null,null,null,null,null,null,null,null,null,null,"Dieselverbruik 40 ton truck",null,null,null,null,null,null,30.53,null,null,"l/100 km"]
[null,null,null,null,null,null,null,null,null,null,null,null,null,null,null,null,null,null,null,null,null,null,null,null,null,null,null,null,null,null,null,null,null,null,null,null,null,null,null,null,null,null,null,null,null,null,null,null,null,null,null,"CO2-NL",null,null,null,null,null,null,null,"Output",null,"kg/tonds chi",null,null,null,null,null,null,{"$f":"CU123/100*(BT124*2)/14.8","v":4.1256756756756756},null,null,100,null,"km",null,null,null,null,null,null,null,null,null,null,null,null,null,null,null,null,null,"Laadfactor",null,null,null,null,null,null,50,null,null,"%"]
[]
[null,null,null,null,null,null,null,null,null,null,null,null,null,null,null,null,null,null,null,null,null,null,null,null,null,null,null,null,null,null,null,null,null,null,null,null,null,null,null,null,null,null,null,null,null,null,null,null,null,null,null,null,null,null,null,null,null,null,null,null,null,null,null,null,null,null,null,null,null,null,null,null,null,null,null,"Bron:"]
[null,null,null,null,null,null,null,null,null,null,null,null,null,null,null,null,null,null,null,null,null,null,null,null,null,null,null,null,null,null,null,null,null,null,null,null,null,null,null,null,null,null,null,null,null,null,null,null,null,null,null,null,null,null,null,null,null,null,null,null,null,null,null,null,null,null,null,null,null,null,null,null,null,null,null,3,"Beschrijving  en data van partijen in de houtketen in Nederland in de periode 11-2017 <-> 2-2018"]
[null,null,null,null,null,null,null,null,null,null,null,null,null,null,null,null,null,null,null,null,null,null,null,null,null,null,null,null,null,null,null,null,null,null,null,null,null,null,null,null,null,null,null,null,null,null,null,null,null,null,null,null,null,null,null,null,null,null,null,null,null,null,null,null,null,null,null,null,null,null,null,null,null,null,null,"alg.","Giuntoli, J., Agostini, A., Edwards, R., & Marelli, L. (2017) ofwel JRC 2017"]
[null,null,null,null,null,null,null,null,null,null,null,null,null,null,null,null,null,null,null,null,null,null,null,null,null,null,null,null,null,null,null,null,null,null,null,null,null,null,null,null,null,null,null,null,null,null,null,null,null,null,null,null,null,null,null,null,null,null,null,null,"NL",null,null,null,"MJ/MJchips"]
[null,null,null,null,null,null,null,null,null,null,null,null,null,null,null,null,null,null,null,null,null,null,null,null,null,null,null,null,null,null,null,null,null,null,null,null,null,null,null,null,null,null,null,null,null,null,null,null,null,null,null,null,null,null,null,null,null,null,null,null,"EU"]
[]
[]
[null,null,null,null,null,null,null,null,null,null,null,null,null,null,null,null,null,null,null,null,null,null,null,null,null,null,null,null,null,null,null,null,null,null,null,null,null,null,null,null,null,null,null,null,null,null,null,null,null,null,null,null,null,null,null,null,null,null,null,null,null,null,null,null,null,null,null,null,null,null,null,null,null,null,"Toelichting"]
[null,null,null,null,null,null,null,null,null,null,null,null,null,null,null,null,null,null,null,null,null,null,null,null,null,null,null,null,null,null,null,null,null,null,null,null,null,null,null,null,null,null,null,null,null,null,null,null,null,null,null,null,null,null,null,null,null,null,null,null,null,null,null,null,null,null,null,null,null,null,null,null,null,null,"EU",null,null,null,null,null,null,null,null,null,null,null,"NL"]
[null,"Processtappen",null,null,null,null,null,null,null,null,null,null,null,null,null,null,null,null,null,null,null,null,null,null,null,null,null,null,null,null,null,null,null,null,null,null,null,null,null,null,null,null,null,null,null,null,null,null,null,null,null,null,null,null,null,null,null,null,null,null,null,null,null,null,null,null,null,null,null,null,null,null,null,null,"Dit is inclusief forwarden, bundelen, oliegebruik, transport van machines van en naar de werkplek, laden en lossen. Het bevat scenario's los top- en takhout, bundelen en oogst van stobben. Voor olieverbruik wordt uitgegaan van 6 % van het dieselverbruik van de machines. Emissiefactor olie is gelijkgesteld aan diesel. \nDe vochtigheid (M) is aangenomen op 50 %.",null,null,null,null,null,null,null,null,null,null,null,"Uitrijden varieert - afhankelijk van de situatie - tussen ca. 1 en 2 liter per verse ton. Het conservatief  gemiddelde wordt gesteld op ca. 2 liter per verse ton. Dit is ca. 4 liter per ton droge stof. Bundelen en stobben oogsten is geen gebruikelijk praktijk in NL."]
[null,"P1 Inzamelen van top- en takhout"]
[null,"P1. Oogsten van top en takhout inclusief -deels- stobben",null,null,null,null,null,"Omschrijving JRC"]
[null,null,"I/O","Eenheid","Aantal","Bron",null,"Dit is inclusief forwarden, bundelen, oliegebruik, transport van machines van en naar de werkplek, laden en lossen. Het bevat scenario's los top- en takhout, bundelen en oogst van stobben. Voor olieverbruik gaat men uit van 6 % van het dieselverbruik van de machines. Emissiefactor olie is gelijkgesteld aan diesel.\n\nDe vochtigheid (M) is aangenomen op 50 %."]
[null,"Diesel","Input","MJ/MJhout",1.202216748768473E-2,1]
[null,"Diesel","Input","liter/tonds",{"$f":"(E139/$R$190)/(1/$R$189)*1000","v":6.3450328407224967},1]
[null,"CO2","Output","g/MJwood",{"$f":"E139*$R$185","v":1.1433081280788178}]
[null,"CO2","Output","kg/tonds",{"$f":"E141*$R$189","v":21.722854433497538}]
[]
[]
[null,null,null,null,null,null,null,null,null,null,null,null,null,null,null,null,null,null,null,null,null,null,null,null,null,null,null,null,null,null,null,null,null,null,null,null,null,null,null,null,null,null,null,null,null,null,null,null,null,null,null,"Bronnen",null,null,null,1,null,null,null,"E.-L. Lindholm, S. Berg, P.-A. Hansson, Eur. J. Forest Res. (2010), 129, 1223-1235"]
[null,null,null,null,null,null,null,null,null,null,null,null,null,null,null,null,null,null,null,null,null,null,null,null,null,null,null,null,null,null,null,null,null,null,null,null,null,null,null,null,null,null,null,null,null,null,null,null,null,null,null,null,null,null,null,2,null,null,null,"Beschrijving  en data van partijen in de houtketen in Nederland in de periode 11-2017 <-> 2-2018"]
[null,null,null,null,null,null,null,null,null,null,null,null,null,null,null,null,null,null,null,null,null,null,null,null,null,null,null,null,null,null,null,null,null,null,null,null,null,null,null,null,null,null,null,null,null,null,null,null,null,null,null,null,null,null,null,"Algemeen",null,null,null,"Giuntoli, J., Agostini, A., Edwards, R., & Marelli, L. (2017) ofwel JRC 2017"]
[]
[]
[]
[]
[null,null,null,null,null,null,null,null,null,null,null,null,null,null,null,null,null,null,null,null,null,null,null,null,null,null,null,null,null,null,null,null,null,null,null,null,null,null,null,null,null,null,null,null,null,null,null,null,null,null,null,null,null,null,null,null,null,null,null,null,null,null,null,null,null,null,null,null,null,null,null,null,null,null,null,null,null,null,null,null,null,null,null,null,"MJ/Mjhout",null,null,null,null,null,null,"CO2 emissiefactoren JRC 2017"]
[null,null,null,null,null,null,null,null,null,null,null,null,null,null,null,null,null,null,null,null,null,null,null,null,null,null,null,null,null,null,null,null,null,null,null,null,null,null,null,null,null,null,null,null,null,null,null,null,null,null,null,null,null,null,null,null,null,null,null,null,null,null,null,null,null,null,null,null,null,null,null,null,null,null,null,null,null,null,null,null,null,null,null,null,"liter/tonds",null,null,null,null,null,null,"EU Diesel WTW",null,null,null,null,null,null,95.1,null,null,"gCO2 / MJdiesel"]
[null,null,null,null,null,null,null,null,null,null,null,null,null,null,null,null,null,null,null,null,null,null,null,null,null,null,null,null,null,null,null,null,null,null,null,null,null,null,null,null,null,null,null,null,null,null,null,null,null,null,null,null,null,null,null,null,null,null,null,null,null,null,null,null,null,null,null,null,null,null,null,null,null,null,null,null,null,null,null,null,null,null,null,null,"liter/m3"]
[null,null,null,null,null,null,null,null,null,null,null,null,null,null,null,null,null,null,null,null,null,null,null,null,null,null,null,null,null,null,null,null,null,null,null,null,null,null,null,null,null,null,null,null,null,null,null,null,null,null,null,null,null,null,null,null,null,null,null,null,null,null,null,null,null,null,null,null,null,null,null,null,null,null,null,null,null,null,null,null,null,null,null,null,null,null,null,null,null,null,null,"Gebruikte aannames algemeen JRC 2017"]
[null,null,null,null,null,null,null,null,null,null,null,null,null,null,null,null,null,null,null,null,null,null,null,null,null,null,null,null,null,null,null,null,null,null,null,null,null,null,null,null,null,null,null,null,null,null,null,null,null,null,null,null,null,null,null,null,null,null,null,null,null,null,null,null,null,null,null,null,null,null,null,null,null,null,null,null,null,null,null,null,null,null,null,null,null,null,null,null,null,null,null,"Dichtheid hout (fijnspar)",null,null,null,null,null,null,425,null,null,"kgdroge stof/m3"]
[null,null,null,null,null,null,null,null,null,null,null,null,null,null,null,null,null,null,null,null,null,null,null,null,null,null,null,null,null,null,null,null,null,null,null,null,null,null,null,null,null,null,null,null,null,null,null,null,null,null,null,null,null,null,null,null,null,null,null,null,null,null,null,null,null,null,null,null,null,null,null,null,null,null,null,null,null,null,null,null,null,null,null,null,null,null,null,null,null,null,null,"Energiewaarde hout",null,null,null,null,null,null,19,null,null,"MJ/kgdroge stof"]
[null,null,null,null,null,null,null,null,null,null,null,null,null,null,null,null,null,null,null,null,null,null,null,null,null,null,null,null,null,null,null,null,null,null,null,null,null,null,null,null,null,null,null,null,null,null,null,null,null,null,null,null,null,null,null,null,null,null,null,null,null,null,null,null,null,null,null,null,null,null,null,null,null,null,null,null,null,null,null,null,null,null,null,null,null,null,null,null,null,null,null,"Energiewaarde diesel",null,null,null,null,null,null,36,null,null,"MJ/liter"]
[null,null,null,null,null,null,null,null,null,null,null,null,null,null,null,null,null,null,null,null,null,null,null,null,null,null,null,null,null,null,null,null,null,null,null,null,null,null,null,null,null,null,null,null,null,null,null,null,null,null,null,null,null,null,null,null,null,null,null,null,null,null,null,null,null,null,null,null,null,null,null,null,null,null,null,null,null,null,null,null,null,null,null,null,null,null,null,null,null,null,null,"Dieselverbruik 40 ton truck",null,null,null,null,null,null,30.53,null,null,"l/100 km"]
[null,null,null,null,null,null,null,null,null,null,null,null,null,null,null,null,null,null,null,null,null,null,null,null,null,null,null,null,null,null,null,null,null,null,null,null,null,null,null,null,null,null,null,null,null,null,null,null,null,null,null,null,null,null,null,null,null,null,null,null,null,null,null,null,null,null,null,null,null,null,null,null,null,null,null,null,null,null,null,null,null,null,null,null,null,null,null,null,null,null,null,"Laadfactor",null,null,null,null,null,null,50,null,null,"%"]
[]
[]
[]
[]
[]
[]
[]
[null,null,null,null,null,null,null,null,null,null,null,null,null,null,null,null,null,null,null,null,null,null,null,null,null,null,null,null,null,null,null,null,null,null,null,null,null,null,null,null,null,null,null,null,null,null,null,null,null,null,null,null,null,null,null,null,null,null,null,null,null,null,null,null,null,null,null,null,null,null,null,null,null,null,null,null,null,null,null,null,"Biomassa in",null,null,null,null,null,null,1]
[null,null,null,null,null,null,null,null,null,null,null,null,null,null,null,null,null,null,null,null,null,null,null,null,null,null,null,null,null,null,null,null,null,null,null,null,null,null,null,null,null,null,null,null,null,null,null,null,null,null,null,null,null,null,null,null,null,null,null,null,null,null,null,null,null,null,null,null,null,null,null,null,null,null,null,null,null,null,null,null,"Biomassa uit",null,null,null,null,null,null,1]
[null,null,null,null,null,null,null,null,null,null,null,null,null,null,null,null,null,null,null,null,null,null,null,null,null,null,null,null,null,null,null,null,null,null,null,null,null,null,null,null,null,null,null,null,null,null,null,null,null,null,null,null,null,null,null,null,null,null,null,null,null,null,null,null,null,null,null,null,null,null,null,null,null,null,null,null,null,null,null,null,"Energie in"]
[null,null,null,null,null,null,null,null,null,null,null,null,null,null,null,null,null,null,null,null,null,null,null,null,null,null,null,null,null,null,null,null,null,null,null,null,null,null,null,null,null,null,null,null,null,null,null,null,null,null,null,null,null,null,null,null,null,null,null,null,null,null,null,null,null,null,null,null,null,null,null,null,null,null,null,null,null,null,null,null,"CO2 uit"]
[]
[]
[]
[]
[]
[]
[]
[]
[]
[]
[]
[]
[]
[null,null,null,null,null,null,null,null,null,null,null,null,null,null,"EU Diesel WTW",null,null,95.1,"gCO2 / MJdiesel"]
[null,null,null,null,null,null,null,null,null,null,null,null,null,null,null,null,null,null,null,null,null,null,null,null,null,null,null,null,null,null,null,null,null,null,null,null,null,null,null,null,null,null,null,null,null,null,null,null,null,null,null,null,null,null,null,null,null,null,null,null,null,null,null,null,null,null,null,null,null,null,null,null,null,null,null,null,"Processtappen"]
[null,null,null,null,null,null,null,null,null,null,null,null,null,null,"Gebruikte aannames algemeen JRC 2017",null,null,null,null,null,null,null,null,null,null,null,null,null,null,null,null,null,null,null,null,null,null,null,null,null,null,null,null,null,null,null,null,null,null,null,null,null,null,null,null,null,null,null,null,null,null,null,null,null,null,null,null,null,null,null,null,null,null,null,null,null,null,null,null,null,null,"P1 Inzamelen van top- en takhout"]
[null,null,null,null,null,null,null,null,null,null,null,null,null,null,"Dichtheid hout (fijnspar)",null,null,425,"kgdroge stof/m3",null,null,null,null,null,null,null,null,null,null,null,null,null,null,null,null,null,null,null,null,null,null,null,null,null,null,null,null,null,null,null,null,null,null,null,null,null,null,null,null,null,null,null,null,null,null,null,null,null,null,null,null,null,null,null,null,null,"P1. Oogsten van top en takhout inclusief -deels- stobben",null,null,null,null,null,null,null,null,null,null,null,null,null,null,null,null,null,null,null,null,null,null,null,"Omschrijving"]
[null,null,null,null,null,null,null,null,null,null,null,null,null,null,"Energiewaarde hout",null,null,19,"MJ/kgdroge stof",null,null,null,null,null,null,null,null,null,null,null,null,null,null,null,null,null,null,null,null,null,null,null,null,null,null,null,null,null,null,null,null,null,null,null,null,null,null,null,null,null,null,null,null,null,null,null,null,null,null,null,null,null,null,null,null,null,null,null,null,null,null,null,null,null,"I/O",null,"Eenheid",null,null,null,null,null,null,"Aantal",null,null,"Bron",null,null,null,"JRC: \"Dit is inclusief forwarden, bundelen, oliegebruik, transport van machines van en naar de werkplek, laden en lossen. Het bevat scenario's los top- en takhout, bundelen en oogst van stobben. Voor olieverbruik gaat men uit van 6 % van het dieselverbruik van de machines. Emissiefactor olie is gelijkgesteld aan diesel. \nDe vochtigheid (M) is aangenomen op 50 %.\"     \n\nNL: uitrijden varieert - afhankelijk van de situatie - tussen ca. 1 en 2 liter per verse ton. Het conservatief  gemiddelde stellen we op ca. 2 liter per verse ton. Dit is ca. 4 liter per ton droge stof. Bundelen en stobben oogsten is geen gebruikelijk praktijk in NL.\n\n     \n     \n     \n     \n     \n     \n"]
[null,null,null,null,null,null,null,null,null,null,null,null,null,null,"Energiewaarde diesel",null,null,36,"MJ/liter",null,null,null,null,null,null,null,null,null,null,null,null,null,null,null,null,null,null,null,null,null,null,null,null,null,null,null,null,null,null,null,null,null,null,null,null,null,null,null,null,null,null,null,null,null,null,null,null,null,null,null,null,null,null,null,null,null,"Diesel",null,null,null,null,null,null,null,"Input",null,"MJ/MJhout",null,null,null,null,null,null,1.202216748768473E-2,null,null,1]
[null,null,null,null,null,null,null,null,null,null,null,null,null,null,"Dieselverbruik 40 ton truck",null,null,30.53,"l/km",null,null,null,null,null,null,null,null,null,null,null,null,null,null,null,null,null,null,null,null,null,null,null,null,null,null,null,null,null,null,null,null,null,null,null,null,null,null,null,null,null,null,null,null,null,null,null,null,null,null,null,null,null,null,null,null,null,"Diesel",null,null,null,null,null,null,null,"Input",null,"liter/tonds",null,null,null,null,null,null,null,null,null,1]
[null,null,null,null,null,null,null,null,null,null,null,null,null,null,"Laadfactor",null,null,50,"%",null,null,null,null,null,null,null,null,null,null,null,null,null,null,null,null,null,null,null,null,null,null,null,null,null,null,null,null,null,null,null,null,null,null,null,null,null,null,null,null,null,null,null,null,null,null,null,null,null,null,null,null,null,null,null,null,null,"CO2",null,null,null,null,null,null,null,"Output",null,"g/MJhout"]
[null,null,null,null,null,null,null,null,null,null,null,null,null,null,null,null,null,null,null,null,null,null,null,null,null,null,null,null,null,null,null,null,null,null,null,null,null,null,null,null,null,null,null,null,null,null,null,null,null,null,null,null,null,null,null,null,null,null,null,null,null,null,null,null,null,null,null,null,null,null,null,null,null,null,null,null,"CO2",null,null,null,null,null,null,null,"Output",null,"kg/tonds"]
[null,null,null,null,null,null,null,null,null,null,null,null,null,null,null,null,null,null,null,null,null,null,null,null,null,null,null,null,null,null,null,null,null,null,null,null,null,null,null,null,null,null,null,null,null,null,null,null,null,null,null,null,null,null,null,null,null,null,null,null,null,null,null,null,null,null,null,null,null,null,null,null,null,null,null,null,"Diesel NL",null,null,null,null,null,null,null,"Input",null,"MJ/MJhout",null,null,null,null,null,null,null,null,null,2,null,null,null,null,null,null,null,null,null,null,null,null,null,null,null,null,null,null,null,null,null,null,null,null,null,null,null,null,null," "]
[null,null,null,null,null,null,null,null,null,null,null,null,null,null,null,null,null,null,null,null,null,null,null,null,null,null,null,null,null,null,null,null,null,null,null,null,null,null,null,null,null,null,null,null,null,null,null,null,null,null,null,null,null,null,null,null,null,null,null,null,null,null,null,null,null,null,null,null,null,null,null,null,null,null,null,null,"Diesel NL",null,null,null,null,null,null,null,"Input",null,"liter/tonds",null,null,null,null,null,null,null,null,null,2]
[null,null,null,null,null,null,null,null,null,null,null,null,null,null,null,null,null,null,null,null,null,null,null,null,null,null,null,null,null,null,null,null,null,null,null,null,null,null,null,null,null,null,null,null,null,null,null,null,null,null,null,null,null,null,null,null,null,null,null,null,null,null,null,null,null,null,null,null,null,null,null,null,null,null,null,null,"CO2 NL",null,null,null,null,null,null,null,"Output",null,"g/MJhout"]
[null,null,null,null,null,null,null,null,null,null,null,null,null,null,null,null,null,null,null,null,null,null,null,null,null,null,null,null,null,null,null,null,null,null,null,null,null,null,null,null,null,null,null,null,null,null,null,null,null,null,null,null,null,null,null,null,null,null,null,null,null,null,null,null,null,null,null,null,null,null,null,null,null,null,null,null,"CO2 NL",null,null,null,null,null,null,null,"Output",null,"kg/tonds",null,null,null,null,null,null,null,null,null,null,null,null,null,"Bron:"]
[null,null,null,null,null,null,null,null,null,null,null,null,null,null,null,null,null,null,null,null,null,null,null,null,null,null,null,null,null,null,null,null,null,null,null,null,null,null,null,null,null,null,null,null,null,null,null,null,null,null,null,null,null,null,null,null,null,null,null,null,null,null,null,null,null,null,null,null,null,null,null,null,null,null,null,null,null,null,null,null,null,null,null,null,null,null,null,null,null,null,null,null,null,null,null,null,null,null,null,null,1,"E.-L. Lindholm, S. Berg, P.-A. Hansson, Eur. J. Forest Res. (2010), 129, 1223-1235"]
[null,null,null,null,null,null,null,null,null,null,null,null,null,null,null,null,null,null,null,null,null,null,null,null,null,null,null,null,null,null,null,null,null,null,null,null,null,null,null,null,null,null,null,null,null,null,null,null,null,null,null,null,null,null,null,null,null,null,null,null,null,null,null,null,null,null,null,null,null,null,null,null,null,null,null,null,null,null,null,null,null,null,null,null,null,null,null,null,null,null,null,null,null,null,null,null,null,null,null,null,2,"Beschrijving  en data van partijen in de houtketen in Nederland in de periode 11-2017 <-> 2-2018"]
[null,null,null,null,null,null,null,null,null,null,null,null,null,null,null,null,null,null,null,null,null,null,null,null,null,null,null,null,null,null,null,null,null,null,null,null,null,null,null,null,null,null,null,null,null,null,null,null,null,null,null,null,null,null,null,null,null,null,null,null,null,null,null,null,null,null,null,null,null,null,null,null,null,null,null,null,null,null,null,null,null,null,null,null,null,null,null,null,null,null,null,null,null,null,null,null,null,null,null,null,"alg.","Giuntoli, J., Agostini, A., Edwards, R., & Marelli, L. (2017) ofwel JRC 2017"]
[null,null,null,null,null,null,null,null,null,null,null,null,null,null,null,null,null,null,null,null,null,null,null,null,null,null,null,null,null,null,null,null,null,null,null,null,null,null,null,null,null,null,null,null,null,null,null,null,null,null,null,null,null,null,null,null,null,null,null,null,null,null,null,null,null,null,null,null,null,null,null,null,null,null,null,null,null,null,null,null,null,"P2 Opslag en drogen langs de weg"]
[null,null,null,null,null,null,null,null,null,null,null,null,null,null,null,null,null,null,null,null,null,null,null,null,null,null,null,null,null,null,null,null,null,null,null,null,null,null,null,null,null,null,null,null,null,null,null,null,null,null,null,null,null,null,null,null,null,null,null,null,null,null,null,null,null,null,null,null,null,null,null,null,null,null,null,null,"P2 Opslag en drogen van top- en takhout langs de weg",null,null,null,null,null,null,null,null,null,null,null,null,null,null,null,null,null,null,null,null,null,null,null,"Omschrijving"]
[null,null,null,null,null,null,null,null,null,null,null,null,null,null,null,null,null,null,null,null,null,null,null,null,null,null,null,null,null,null,null,null,null,null,null,null,null,null,null,null,null,null,null,null,null,null,null,null,null,null,null,null,null,null,null,null,null,null,null,null,null,null,null,null,null,null,null,null,null,null,null,null,null,null,null,null,null,null,null,null,null,null,null,null,"I/O",null,"Eenheid",null,null,null,null,null,null,"Aantal",null,null,"Bron",null,null,null,"JRC: \"Dit is inclusief drogen in de open lucht langs de weg afgedekt tegen de regen. Gedurende 3-8 maanden. Aangenomen is dat de vochtigheid (M) afneemt van 50 naar 30 %, waarbij een verlies aan droge stof van 5 %.\"     \n\nNL: meestal wordt niet gedroogd langs de weg en vrijwel direct gechipt en met een vochtigheid (M45) aan de klant geleverd. Verlies is niet bekend, maar zal door de kortere opslag duur minder zijn. Voor de input/output verhouding telt bij JRC de MJ in droge massa. De vochtigheid telt niet mee bij input/output aan MJ. Voor het gemak is hetzelfde getal aangehouden voor NL, als bij JRC.\n     \n     \n     \n"]
[null,null,null,null,null,null,null,null,null,null,null,null,null,null,null,null,null,null,null,null,null,null,null,null,null,null,null,null,null,null,null,null,null,null,null,null,null,null,null,null,null,null,null,null,null,null,null,null,null,null,null,null,null,null,null,null,null,null,null,null,null,null,null,null,null,null,null,null,null,null,null,null,null,null,null,null,"Hout",null,null,null,null,null,null,null,"Input",null,"MJ/MJhout",null,null,null,null,null,null,1.0526315789473699,null,null,"1, 2, 3"]
[null,null,null,null,null,null,null,null,null,null,null,null,null,null,null,null,null,null,null,null,null,null,null,null,null,null,null,null,null,null,null,null,null,null,null,null,null,null,null,null,null,null,null,null,null,null,null,null,null,null,null,null,null,null,null,null,null,null,null,null,null,null,null,null,null,null,null,null,null,null,null,null,null,null,null,null,"Hout",null,null,null,null,null,null,null,"Output",null,"MJhout",null,null,null,null,null,null,1,null,null,1]
[null,null,null,null,null,null,null,null,null,null,null,null,null,null,null,null,null,null,null,null,null,null,null,null,null,null,null,null,null,null,null,null,null,null,null,null,null,null,null,null,null,null,null,null,null,null,null,null,null,null,null,null,null,null,null,null,null,null,null,null,null,null,null,null,null,null,null,null,null,null,null,null,null,null,null,null,"Hout-NL",null,null,null,null,null,null,null,"Input",null,"MJ/MJhout",null,null,null,null,null,null,1.0526315789473699]
[null,null,null,null,null,null,null,null,null,null,null,null,null,null,null,null,null,null,null,null,null,null,null,null,null,null,null,null,null,null,null,null,null,null,null,null,null,null,null,null,null,null,null,null,null,null,null,null,null,null,null,null,null,null,null,null,null,null,null,null,null,null,null,null,null,null,null,null,null,null,null,null,null,null,null,null,"Hout-NL",null,null,null,null,null,null,null,"Output",null,"MJhout",null,null,null,null,null,null,1]
[]
[]
[]
[null,null,null,null,null,null,null,null,null,null,null,null,null,null,null,null,null,null,null,null,null,null,null,null,null,null,null,null,null,null,null,null,null,null,null,null,null,null,null,null,null,null,null,null,null,null,null,null,null,null,null,null,null,null,null,null,null,null,null,null,null,null,null,null,null,null,null,null,null,null,null,null,null,null,null,null,null,null,null,null,null,null,null,null,null,null,null,null,null,null,null,null,null,null,null,null,null,null,null,null,"Bron:"]
[null,null,null,null,null,null,null,null,null,null,null,null,null,null,null,null,null,null,null,null,null,null,null,null,null,null,null,null,null,null,null,null,null,null,null,null,null,null,null,null,null,null,null,null,null,null,null,null,null,null,null,null,null,null,null,null,null,null,null,null,null,null,null,null,null,null,null,null,null,null,null,null,null,null,null,null,null,null,null,null,null,null,null,null,null,null,null,null,null,null,null,null,null,null,null,null,null,null,null,null,1,"Hamelinck, C.N., Suurs, R.A.A., Faaij, A.P.C., Biomass and Bioenergy (2005), 29, 114 - 134"]
[null,null,null,null,null,null,null,null,null,null,null,null,null,null,null,null,null,null,null,null,null,null,null,null,null,null,null,null,null,null,null,null,null,null,null,null,null,null,null,null,null,null,null,null,null,null,null,null,null,null,null,null,null,null,null,null,null,null,null,null,null,null,null,null,null,null,null,null,null,null,null,null,null,null,null,null,null,null,null,null,null,null,null,null,null,null,null,null,null,null,null,null,null,null,null,null,null,null,null,null,2,"Kofman, P., \"Storage of short rotation coppice willow fuel\", 2012. "]
[null,null,null,null,null,null,null,null,null,null,null,null,null,null,null,null,null,null,null,null,null,null,null,null,null,null,null,null,null,null,null,null,null,null,null,null,null,null,null,null,null,null,null,null,null,null,null,null,null,null,null,null,null,null,null,null,null,null,null,null,null,null,null,null,null,null,null,null,null,null,null,null,null,null,null,null,null,null,null,null,null,null,null,null,null,null,null,null,null,null,null,null,null,null,null,null,null,null,null,null,null,"http://www.coford.ie/media/coford/content/publications/projectreports/cofordconnects/HAR30_LR.PDF"]
[null,null,null,null,null,null,null,null,null,null,null,null,null,null,null,null,null,null,null,null,null,null,null,null,null,null,null,null,null,null,null,null,null,null,null,null,null,null,null,null,null,null,null,null,null,null,null,null,null,null,null,null,null,null,null,null,null,null,null,null,null,null,null,null,null,null,null,null,null,null,null,null,null,null,null,null,null,null,null,null,null,null,null,null,null,null,null,null,null,null,null,null,null,null,null,null,null,null,null,null,3,"E.-L. Lindholm, S. Berg, P.-A. Hansson, Eur. J. Forest Res. (2010), 129, 1223-1235"]
[null,null,null,null,null,null,null,null,null,null,null,null,null,null,null,null,null,null,null,null,null,null,null,null,null,null,null,null,null,null,null,null,null,null,null,null,null,null,null,null,null,null,null,null,null,null,null,null,null,null,null,null,null,null,null,null,null,null,null,null,null,null,null,null,null,null,null,null,null,null,null,null,null,null,null,null,null,null,null,null,null,null,null,null,null,null,null,null,null,null,null,null,null,null,null,null,null,null,null,null,"alg.","Giuntoli, J., Agostini, A., Edwards, R., & Marelli, L. (2017) ofwel JRC 2017"]
[null,null,null,null,null,null,null,null,null,null,null,null,null,null,null,null,null,null,null,null,null,null,null,null,null,null,null,null,null,null,null,null,null,null,null,null,null,null,null,null,null,null,null,null,null,null,null,null,null,null,null,null,null,null,null,null,null,null,null,null,null,null,null,null,null,null,null,null,null,null,null,null,null,null,null,null,null,null,null,null,null,null,null,null,null,null,null,null,null,null,null,null,null,null,null,null,null,null,null,null,"alg.","Beschrijving  en data van partijen in de houtketen in Nederland in de periode 11-2017 <-> 2-2018"]
[null,null,null,null,null,null,null,null,null,null,null,null,null,null,null,null,null,null,null,null,null,null,null,null,null,null,null,null,null,null,null,null,null,null,null,null,null,null,null,null,null,null,null,null,null,null,null,null,null,null,null,null,null,null,null,null,null,null,null,null,null,null,null,null,null,null,null,null,null,null,null,null,null,null,null,null,"P3 Chippen"]
[null,null,null,null,null,null,null,null,null,null,null,null,null,null,null,null,null,null,null,null,null,null,null,null,null,null,null,null,null,null,null,null,null,null,null,null,null,null,null,null,null,null,null,null,null,null,null,null,null,null,null,null,null,null,null,null,null,null,null,null,null,null,null,null,null,null,null,null,null,null,null,null,null,null,null,null,"P3 Chippen",null,null,null,null,null,null,null,null,null,null,null,null,null,null,null,null,null,null,null,null,null,null,null,"Omschrijving JRC"]
[null,null,null,null,null,null,null,null,null,null,null,null,null,null,null,null,null,null,null,null,null,null,null,null,null,null,null,null,null,null,null,null,null,null,null,null,null,null,null,null,null,null,null,null,null,null,null,null,null,null,null,null,null,null,null,null,null,null,null,null,null,null,null,null,null,null,null,null,null,null,null,null,null,null,null,null,null,null,null,null,null,null,null,null,"I/O",null,"Eenheid",null,null,null,null,null,null,"Aantal",null,null,"Bron",null,null,null,"JRC: Dit is een gemiddelde tussen efficient centraal  chippen (elektrisch) en op kleinere schaal langs de weg chippen (diesel).\nEr wordt uitgegaan van een verlies van 2,5 % aan droge massa bij chippen. \n\nNL: In Nederland wordt vooral met diesel gechipt. Het dieselverbruik bij chippen is ca. 1,5 liter per verse ton. Uitgaande van het conservatief gemiddelde is dit 2 liter per verse ton. Dit is 4 liter per ton droge stof."]
[null,null,null,null,null,null,null,null,null,null,null,null,null,null,null,null,null,null,null,null,null,null,null,null,null,null,null,null,null,null,null,null,null,null,null,null,null,null,null,null,null,null,null,null,null,null,null,null,null,null,null,null,null,null,null,null,null,null,null,null,null,null,null,null,null,null,null,null,null,null,null,null,null,null,null,null,"Hout",null,null,null,null,null,null,null,"Input",null,"MJ/MJchips",null,null,null,null,null,null,1.0249999999999999,null,null,"1,2"]
[null,null,null,null,null,null,null,null,null,null,null,null,null,null,null,null,null,null,null,null,null,null,null,null,null,null,null,null,null,null,null,null,null,null,null,null,null,null,null,null,null,null,null,null,null,null,null,null,null,null,null,null,null,null,null,null,null,null,null,null,null,null,null,null,null,null,null,null,null,null,null,null,null,null,null,null,"Hout",null,null,null,null,null,null,null,"Input",null,"MJ/MJchips",null,null,null,null,null,null,1]
[null,null,null,null,null,null,null,null,null,null,null,null,null,null,null,null,null,null,null,null,null,null,null,null,null,null,null,null,null,null,null,null,null,null,null,null,null,null,null,null,null,null,null,null,null,null,null,null,null,null,null,null,null,null,null,null,null,null,null,null,null,null,null,null,null,null,null,null,null,null,null,null,null,null,null,null,"Diesel",null,null,null,null,null,null,null,"Input",null,"MJ/MJchips",null,null,null,null,null,null,3.3570000000000002E-3,null,null,1]
[null,null,null,null,null,null,null,null,null,null,null,null,null,null,null,null,null,null,null,null,null,null,null,null,null,null,null,null,null,null,null,null,null,null,null,null,null,null,null,null,null,null,null,null,null,null,null,null,null,null,null,null,null,null,null,null,null,null,null,null,null,null,null,null,null,null,null,null,null,null,null,null,null,null,null,null,"Diesel",null,null,null,null,null,null,null,"Input",null,"l/tonds chips",null,null,null,null,null,null,{"$f":"(CP223/$CU$122)/(1/$CU$121)*1000","v":1.7717500000000002}]
[null,null,null,null,null,null,null,null,null,null,null,null,null,null,null,null,null,null,null,null,null,null,null,null,null,null,null,null,null,null,null,null,null,null,null,null,null,null,null,null,null,null,null,null,null,null,null,null,null,null,null,null,null,null,null,null,null,null,null,null,null,null,null,null,null,null,null,null,null,null,null,null,null,null,null,null,"CO2",null,null,null,null,null,null,null,"Output",null,"g/MJchips",null,null,null,null,null,null,{"$f":"CP223*$CU$117","v":0.3192507}]
[null,null,null,null,null,null,null,null,null,null,null,null,null,null,null,null,null,null,null,null,null,null,null,null,null,null,null,null,null,null,null,null,null,null,null,null,null,null,null,null,null,null,null,null,null,null,null,null,null,null,null,null,null,null,null,null,null,null,null,null,null,null,null,null,null,null,null,null,null,null,null,null,null,null,null,null,"CO2",null,null,null,null,null,null,null,"Output",null,"kg/tonds chi",null,null,null,null,null,null,{"$f":"CP225*$R$189","v":6.0657633000000004}]
[null,null,null,null,null,null,null,null,null,null,null,null,null,null,null,null,null,null,null,null,null,null,null,null,null,null,null,null,null,null,null,null,null,null,null,null,null,null,null,null,null,null,null,null,null,null,null,null,null,null,null,null,null,null,null,null,null,null,null,null,null,null,null,null,null,null,null,null,null,null,null,null,null,null,null,null,"Diesel NL",null,null,null,null,null,null,null,"Input",null,"MJ/MJhout",null,null,null,null,null,null,{"$f":"CP228*CU122/CU121/1000","v":7.5789473684210523E-3},null,null,3,null,null,null,"Bron:"]
[null,null,null,null,null,null,null,null,null,null,null,null,null,null,null,null,null,null,null,null,null,null,null,null,null,null,null,null,null,null,null,null,null,null,null,null,null,null,null,null,null,null,null,null,null,null,null,null,null,null,null,null,null,null,null,null,null,null,null,null,null,null,null,null,null,null,null,null,null,null,null,null,null,null,null,null,"Diesel NL",null,null,null,null,null,null,null,"Input",null,"liter/tonds",null,null,null,null,null,null,4,null,null,3,null,null,null,1,"E.-L. Lindholm, S. Berg, P.-A. Hansson, Eur. J. Forest Res. (2010), 129, 1223-1235"]
[null,null,null,null,null,null,null,null,null,null,null,null,null,null,null,null,null,null,null,null,null,null,null,null,null,null,null,null,null,null,null,null,null,null,null,null,null,null,null,null,null,null,null,null,null,null,null,null,null,null,null,null,null,null,null,null,null,null,null,null,null,null,null,null,null,null,null,null,null,null,null,null,null,null,null,null,"CO2 NL",null,null,null,null,null,null,null,"Output",null,"g/MJhout",null,null,null,null,null,null,{"$f":"CP227*$CU$117","v":0.72075789473684204},null,null,null,null,null,null,2,"Sikkema, R., Junginger, M., Pichler, W., Hayes, S., Faaij, A.P.C., Biofuels Bioproducts & Biorefininig (2010), 4, 132 - 153"]
[null,null,null,null,null,null,null,null,null,null,null,null,null,null,null,null,null,null,null,null,null,null,null,null,null,null,null,null,null,null,null,null,null,null,null,null,null,null,null,null,null,null,null,null,null,null,null,null,null,null,null,null,null,null,null,null,null,null,null,null,null,null,null,null,null,null,null,null,null,null,null,null,null,null,null,null,"CO2 NL",null,null,null,null,null,null,null,"Output",null,"kg/tonds",null,null,null,null,null,null,{"$f":"CP229*$R$189","v":13.694399999999998},null,null,null,null,null,null,3,"Beschrijving  en data van partijen in de houtketen in Nederland in de periode 11-2017 <-> 2-2018"]
[null,null,null,null,null,null,null,null,null,null,null,null,null,null,null,null,null,null,null,null,null,null,null,null,null,null,null,null,null,null,null,null,null,null,null,null,null,null,null,null,null,null,null,null,null,null,null,null,null,null,null,null,null,null,null,null,null,null,null,null,null,null,null,null,null,null,null,null,null,null,null,null,null,null,null,null,null,null,null,null,null,null,null,null,null,null,null,null,null,null,null,null,null,null,null,null,null,null,null,null,"alg.","Giuntoli, J., Agostini, A., Edwards, R., & Marelli, L. (2017) ofwel JRC 2017"]

{"sheet":"Berekenen","index":10,"n_rows":704,"n_cols":24,"rows_kept":704,"cut":false,"hidden":true,"merged":[]}
[]
[null,"INHOUD",null,null,null,null,null,null,"SAMENVATTING"]
[null,null,null,null,null,null,null,null,null,null,null,null,null,null,null,null,null,"Hout","Proces","Δ","Dimensie"]
[null,"Algemeen",null,null,null,null,null,null,null,null,null,null,null,null,null,null,"RHO-0",{"$f":"Hout_RHO_0","v":633},{"$f":"Proces_RHO_0","v":633},{"$f":"S4-R4","v":0},"kg/m3"]
[null,null,null,"Kleurcodes",null,null,null,null,"Doorzet Hout",null,null,{"$f":"Uit_Hout_Doorzet_m3","v":11224.489795918365},"m3",null,null,null,"Krimp",{"$f":"Hout_Krimp","v":15.4},{"$f":"Proces_Krimp","v":15.4},{"$f":"S5-R5","v":0},"%"]
[null,null,null,null,"= Definitie van de naam",null,null,null,"Doorzet Proces",null,null,{"$f":"Uit_Proces_Doorzet_m3","v":10000},"m3",null,null,null,"Vezel verzadigingspunt",{"$f":"Hout_Krimp_Hs","v":23},{"$f":"Proces_Krimp_Hs","v":23},0,"%"]
[null,null,null,null,null,null,null,null,"Doorzet Transport",null,null,{"$f":"Uit_Transport_Doorzet_m3","v":10000},"m3",null,null,null,"RHO Volume Factor=1",{"$f":"Hout_RHO_VF1","v":1071.0360000000001},{"$f":"Proces_RHO_VF1","v":1071.0360000000001},0,"m3"]
[null,null,null,"Hoofdstuk",null,null,"Rijnummer",null,null,null,null,null,null,null,null,null,"Massa hout",{"$f":"Hout_Massa","v":535.51800000000003},{"$f":"Proces_Massa","v":535.51800000000003},0,"kg"]
[null,"Hout",null,null,null,null,{"$f":"Rij_Hout","v":68},null,null,null,null,null,null,null,null,null,"Massa water",{"$f":"Hout_Water","v":535.51800000000003},{"$f":"Proces_Water","v":535.51800000000003},0,"kg"]
[null,null,null,"Houteigenschappen",null,null,{"$f":"Rij_Hout_Eigenschappen","v":88},null,null,null,null,null,null,null,null,null,"Water+Hout",{"$f":"Hout_Massa_Water","v":1071.0360000000001},{"$f":"Proces_Massa_Water","v":1071.0360000000001},0,"kg"]
[null,null,null,"Doorzet",null,null,{"$f":"Rij_Hout_Doorzet","v":121},null,null,null,null,null,null,null,null,null,"Volume factor",{"$f":"Hout_Vorm_Vulling","v":0.3},{"$f":"Proces_Vorm_Vulling","v":0.33},3.0000000000000027E-2,"-"]
[null,null,null,"Ketens",null,null,{"$f":"Rij_Hout_Keten","v":158},null,null,null,null,null,null,null,null,null,"RHO bij volume",{"$f":"Hout_RHO","v":321.31080000000003},{"$f":"Proces_RHO","v":353.44188000000003},32.131079999999997,"kg/m3"]
[null,null,null,"Samenvatting",null,null,{"$f":"Rij_Hout_Samenvatting","v":{"$error":"#REF!"}},null,null,null,null,null,null,null,null,null,"HHV-ds",{"$f":"Hout_HHVds","v":19.3},{"$f":"Proces_HHVds","v":19.3},0,"GJ/ton"]
[null,null,null,null,null,null,null,null,null,null,null,null,null,null,null,null,"H2",{"$f":"Hout_H2","v":6},{"$f":"Proces_H2","v":6},0,"%"]
[null,"Proces",null,null,null,null,{"$f":"Rij_Proces","v":197},null,null,null,null,null,null,null,null,null,"LHV-ds",{"$f":"Hout_LHVds","v":19.3},{"$f":"Proces_LHVds","v":19.3},0,"GJ/ton"]
[null,null,null,"Houteigenschappen",null,null,{"$f":"Rij_Proces_Houteigenschappen","v":199},null,null,null,null,null,null,null,null,null,"LHV-Hm",{"$f":"Hout_LHVm","v":9.65},{"$f":"Proces_LHVm","v":9.65},0,"GJ/ton"]
[null,null,null,"Doorzet",null,null,{"$f":"Rij_Proces_Doorzet","v":233},null,null,null,null,null,null,null,null,null,"LHV-Hv",{"$f":"Hout_LHVv","v":3.1006492200000002},{"$f":"Proces_LHVv","v":3.4107141420000002},0.31006492200000002,"GJ/m3"]
[null,null,null,"Proces Aandrijving tijd",null,null,{"$f":"Rij_Proces_Aandrijving_Tijd","v":257},null,null,null,null,null,null,null,null,null,null,"Hout","Proces","Δ","Dimensie","P/H-%"]
[null,null,null,"Proces aandrijving CO2",null,null,{"$f":"Rij_Proces_Aandrijving_CO2","v":274},null,null,null,null,null,null,null,null,null,"Doorzet",{"$f":"Uit_Hout_Doorzet_kg","v":3606549.7959183669},{"$f":"Uit_Proces_Doorzet_kg","v":3534418.8},-72130.995918367058,"kg",{"$f":"S19/R19-1","v":-1.9999999999999907E-2},null,21477.642022609085]
[null,null,null,"Proces samenvatting",null,null,{"$f":"Rij_Proces_Samenvatting","v":386},null,null,null,null,null,null,null,null,null,"Doorzet",{"$f":"Uit_Hout_Doorzet_kgds","v":1803274.8979591834},{"$f":"Uit_Proces_Doorzet_kgds","v":1767209.4},-36065.497959183529,"kgds",{"$f":"S20/R20-1","v":-1.9999999999999907E-2},null,12886.585213565451]
[null,null,null,null,null,null,null,null,null,null,null,null,null,null,null,null,"Doorzet",{"$f":"Uit_Hout_Doorzet_ton","v":3606.5497959183667},{"$f":"Uit_Proces_Doorzet_ton","v":3534.4187999999999},-72.130995918366807,"ton",-1.9999999999999907E-2,null,21.477642022609086]
[null,"Transport",null,null,null,null,{"$f":"Rij_Transport","v":404},null,null,null,null,null,null,null,null,null,"Doorzet",{"$f":"Uit_Hout_Doorzet_tonds","v":1803.2748979591834},{"$f":"Uit_Proces_Doorzet_tonds","v":1767.2094},-36.065497959183404,"tonds",-1.9999999999999907E-2,null,12.886585213565452]
[null,null,null,"Houteigenschappen",null,null,{"$f":"Rij_Transport_Houteigenschappen","v":406},null,null,null,null,null,null,null,null,null,"Doorzet",{"$f":"Uit_Hout_Doorzet_GJ","v":34803.205530612242},{"$f":"Uit_Proces_Doorzet_GJ","v":34107.14142},-696.06411061224208,"GJ",-1.9999999999999907E-2,null,216.80095856205602]
[null,null,null,"Doorzet",null,null,{"$f":"Rij_Transport_Doorzet","v":439},null,null,null,null,null,null,null,null,null,"Doorzet",{"$f":"Uit_Hout_Doorzet_MWh","v":9667.5570918367339},{"$f":"Uit_Proces_Doorzet_MWh","v":9474.2059499999996},-193.35114183673431,"MWh",-2.0000000000000018E-2,null,60.222488489460005]
[null,null,null,"Transport Aandrijving CO2",null,null,{"$f":"Rij_Transport_Aandrijving_CO2","v":463},null,null,null,null,null,null,null,null,null,"Doorzet",{"$f":"Uit_Hout_Doorzet_kWh","v":9667557.0918367337},{"$f":"Uit_Proces_Doorzet_kWh","v":9474205.9499999993},-193351.14183673449,"kWh",-2.0000000000000018E-2,null,60222.488489460004]
[null,null,null,"Transport samenvatting",null,null,{"$f":"Rij_Transport_Samenvatting","v":585}]
[]
[]
[null,"Drogen",null,"Proces Warmtetoevoer (Drogen) CO2",null,null,{"$f":"Rij_Proces_Warmtetoevoer","v":604}]
[]
[]
[]
[]
[]
[]
[]
[]
[null,"ALGEMEEN",{"$f":"ROW()","v":38}]
[]
[]
[]
[null,"Methodiek-ID",null,"EU",null,"Algemeen_Berekening_Methodiek_ID"]
[null,"Berekening - methodiek",null,{"$f":"IF(Algemeen_Berekening_Methodiek_ID=\"EU\",\"Biograce II\",IF(Algemeen_Berekening_Methodiek_ID=\"NL\",\"CO2-emissiefactoren\",\"Beide methodieken\"))","v":"Biograce II"}]
[]
[null,null,null,null,null,"De relatie tussen de bovenwaarde (HHV - Higher Heating Vaue) en de onderwaarde (LHV - Lower Heting Value) "]
[null,null,null,null,null,"van de Verbrandingswaarde (HV - Heating Value) bestaat uit drie termen:"]
[null,null,null,null,null,"1. De afhankelijkheid van de vochtigheid: HHV * (100-Vochtigheid)/Vochtigheid"]
[null,null,null,null,null,"2. Correctie voor de verdampingswarmte van water: 2,441 * Vochtigheid / 100"]
[null,null,null,null,null,"3. Correctie voor het waterstofgehalte van de biomassa: H2/(100*2)*18,02*2,447*(1-Vochtigheid/100)"]
[null,null,null,null,null,"De LHV wordt daarmee:"]
[null,null,null,null,null,"LHV = HHV * (100-Vochtigheid)/Vochtigheid - 2,441 * Vochtigheid / 100 - H2/(100*2)*18,02*2,447*(1-Vochtigheid/100)"]
[null,null,null,null,null,"In BioGrace II wordt alleen de eerste term meegenomen omdat niet duidelijk is waarvoor de"]
[null,null,null,null,null,"biomassa wordt gebruikt. Dus ook voor de productie van elektriciteit en warmte/koude  !"]
[null,null,null,null,null,"In de regel wordt de waterstofterm nooit meegenomen. (ca 3%)"]
[null,null,null,null,null,"Alleen in de berekening van eigenschappen van biomassa door Klimaaktiv (Oostenrijk)"]
[]
[]
[null,"Berekening LHVds",null,1,null,"LHV_Vochtigheid"]
[null,"Berekening LHVds-Verdamping",null,0,null,"LHV_Vochtigheid_Verdampingswarmte"]
[null,"Berekening LHVds-Verdamping-H2",null,0,null,"LHV_Vochtigheid_Verdampingswarmte_H2"]
[null,null,null,null,null,"1 = Met term"]
[null,null,null,null,null,"0 = Zonder term"]
[]
[]
[]
[]
[]
[null,"HOUT",{"$f":"ROW()","v":68}]
[]
[null,"Samenvatting Proces",{"$f":"ROW()","v":70},null,null,null,null,null,null,null,null,null,null,null,{"$f":"B70","v":"Samenvatting Proces"}]
[]
[null,"NL of EU",null,{"$f":"Hout_Keten_NL_EU","v":0},null,"Hout_Keten_NL_EU",null,null,null,null,null,null,null,"m3","MJ"]
[null,null,null,null,null,null,null,null,null,null,null,null,null,"kg","GJ"]
[null,null,null,{"$f":"Samenvatting_Hout_Doorzet_Dim","v":"tonds"},null,"Samenvatting_Hout_Doorzet_Dim",null,null,null,null,null,null,null,"kgds","MWh"]
[null,"Doorzet",null,{"$f":"IF(Samenvatting_Hout_Doorzet_Dim=\"m3\",Uit_Hout_Doorzet_m3,\nIF(Samenvatting_Hout_Doorzet_Dim=\"kg\",Uit_Hout_Doorzet_kg,\nIF(Samenvatting_Hout_Doorzet_Dim=\"kgds\",Uit_Hout_Doorzet_kgds,\nIF(Samenvatting_Hout_Doorzet_Dim=\"ton\",Uit_Hout_Doorzet_ton,\nIF(Samenvatting_Hout_Doorzet_Dim=\"tonds\",Uit_Hout_Doorzet_tonds,\nIF(Samenvatting_Hout_Doorzet_Dim=\"MJ\",Uit_Hout_Doorzet_MJ,\nIF(Samenvatting_Hout_Doorzet_Dim=\"GJ\",Uit_Hout_Doorzet_GJ,\nIF(Samenvatting_Hout_Doorzet_Dim=\"kWh\",Uit_Hout_Doorzet_kWh,\nIF(Samenvatting_Hout_Doorzet_Dim=\"MWh\",Uit_Hout_Doorzet_MWh,\"Berekening Samenvatting Hout Doorzet\")))))))))","v":1803.2748979591834},null,"Samenvatting_Hout_Doorzet",null,null,null,null,null,null,null,"ton","kWh"]
[null,null,null,null,null,null,null,null,null,null,null,null,null,"tonds"]
[null,null,null,"NL","EU"]
[null,"CO2 Totaal",null,{"$f":"Keten_NL_Stap1_6_CO2","v":2.405263157894737},{"$f":"Keten_EU_Stap1_6_CO2","v":4.8407965330386267},"gCO2eq/MJ","Samenvatting_NL_Keten_CO2_g_MJ",null,null,null,"Samenvatting_EU_Keten_CO2_g_MJ"]
[]
[null,"CO2 Totaal",null,{"$f":"Samenvatting_NL_Keten_CO2_g_MJ*Uit_Proces_Doorzet_MJ","v":82036650.678631589},{"$f":"Samenvatting_EU_Keten_CO2_g_MJ*Uit_Proces_Doorzet_MJ","v":165105731.93779415},"g","Samenvatting_NL_Keten_CO2_g",null,null,null,"Samenvatting_EU_Keten_CO2_g",null,null,"gCO2eq"]
[null,"CO2 Totaal",null,{"$f":"Samenvatting_NL_Keten_CO2_g/1000","v":82036.650678631588},{"$f":"Samenvatting_EU_Keten_CO2_g/1000","v":165105.73193779416},"kg","Samenvatting_NL_Keten_CO2_kg",null,null,null,"Samenvatting_EU_Keten_CO2_kg",null,null,"kgCO2eq"]
[null,"CO2 Totaal",null,{"$f":"Samenvatting_NL_Keten_CO2_kg/1000","v":82.036650678631588},{"$f":"Samenvatting_EU_Keten_CO2_kg/1000","v":165.10573193779416},"ton","Samenvatting_NL_Keten_CO2_ton",null,null,null,"Samenvatting_EU_Keten_CO2_ton",null,null,"tonCO2eq"]
[null,"CO2 Totaal",null,{"$f":"Samenvatting_NL_Keten_CO2_ton/1000","v":8.2036650678631584E-2},{"$f":"Samenvatting_EU_Keten_CO2_ton/1000","v":0.16510573193779415},"Mton","Samenvatting_NL_Keten_CO2_Mton",null,null,null,"Samenvatting_EU_Keten_CO2_Mton",null,null,"MtonCO2eq"]
[]
[null,null,null,{"$f":"Samenvatting_Hout_CO2T_Dim","v":"kgCO2eq"},{"$f":"Samenvatting_Hout_CO2T_Dim","v":"kgCO2eq"},null,"Samenvatting_Hout_CO2T_Dim"]
[null,"CO2 productie Hout",null,{"$f":"IF(Samenvatting_Hout_CO2T_Dim=\"gCO2eq\",Samenvatting_NL_Keten_CO2_g,\nIF(Samenvatting_Hout_CO2T_Dim=\"kgCO2eq\",Samenvatting_NL_Keten_CO2_kg,\nIF(Samenvatting_Hout_CO2T_Dim=\"tonCO2eq\",Samenvatting_NL_Keten_CO2_ton,\nIF(Samenvatting_Hout_CO2T_Dim=\"MtonCO2eq\",Samenvatting_NL_Keten_CO2_Mton,))))","v":82036.650678631588},{"$f":"IF(Samenvatting_Hout_CO2T_Dim=\"gCO2eq\",Samenvatting_EU_Keten_CO2_g,\nIF(Samenvatting_Hout_CO2T_Dim=\"kgCO2eq\",Samenvatting_EU_Keten_CO2_kg,\nIF(Samenvatting_Hout_CO2T_Dim=\"tonCO2eq\",Samenvatting_EU_Keten_CO2_ton,\nIF(Samenvatting_Hout_CO2T_Dim=\"MtonCO2eq\",Samenvatting_EU_Keten_CO2_Mton,))))","v":165105.73193779416},{"$f":"Samenvatting_Hout_CO2T_Dim","v":"kgCO2eq"},"Samenvatting_Hout_CO2T"]
[]
[null,"Houteigenschappen",{"$f":"ROW()","v":88},null,null,null,null,null,null,null,null,null,null,null,"Houteigenschappen"]
[]
[null,"Omschrijving",null,"Waarde","Dimensie","Naam"]
[null,"Houtsoort",null,{"$f":"Hout_Soort","v":"Loofhout mix NL"},"-","Hout_Soort"]
[null,"Vochtigheid",null,{"$f":"Hout_Vochtigheid","v":50},"%","Hout_Vochtigheid",null,null,null,null,null,null,null,null,null,null,"Grundeingabe","Holz- bzw. Brennstoffart","Auswahl im Drop-Down-Menü",null,null,"Eiche"]
[null,"Vochtgehalte",null,{"$f":"Hout_Vochtigheid/(100-Hout_Vochtigheid)*100","v":100},"%","Uit_Hout_Vochtgehalte",null,null,null,null,null,null,null,null,null,null,null,"Brennstoffgruppe","Zuordnung zu Gruppen",null,null,"Laubholz (LH)"]
[null,null,null,null,null,null,null,null,null,null,null,null,null,null,null,null,null,"Sortiment","Auswahl im Drop-Down-Menü",null,null,"Holzhackgut G30"]
[null,"RHO-0",null,{"$f":"LOOKUP(Hout_Soort,Lijst_Hout_Soort,Lijst_Hout_RHO_Darr)","v":633},"kg/m3","Hout_RHO_0",null,null,null,null,null,null,null,null,null,null,null,"Umrechnungsfaktor","1 fm = x rm bzw.  x srm",null,null,2.5]
[null,"Krimp",null,{"$f":"LOOKUP(Hout_Soort,Lijst_Hout_Soort,Lijst_Hout_Krimp)","v":15.4},"%","Hout_Krimp",null,null,null,null,null,null,null,null,null,null,null,"Einheit","Übliches Handelsmaß",null,null,"srm"]
[null,"Vezel verzadigingspunt",null,{"$f":"LOOKUP(Hout_Soort,Lijst_Hout_Soort,Lijst_Hout_VVP)","v":23},"%","Hout_Krimp_Hs"]
[null,"RHO Volume Factor=1",null,{"$f":"IF(Hout_Vochtigheid>Hout_Krimp_Hs,Hout_RHO_0*(1-Hout_Krimp/100)/(1-Hout_Vochtigheid/100),Hout_RHO_0*(1-Hout_Vochtigheid/Hout_Krimp_Hs*Hout_Krimp/100)/(1-Hout_Vochtigheid/100))","v":1071.0360000000001},"m3","Hout_RHO_VF1",null,null,null,null,null,null,null,null,null,null,"Wasseranteil","Wassergehalt (H2O)","% (Gewicht, FS)",null,null,50]
[null,"Massa hout",null,{"$f":"Hout_RHO_VF1*(1-Hout_Vochtigheid/100)","v":535.51800000000003},"kg","Hout_Massa",null,null,null,null,null,null,null,null,null,null,null,"Wasserstoffgehalt (H)","% (Gewicht, TS)",null,null,6]
[null,"Massa water",null,{"$f":"Hout_RHO_VF1*Hout_Vochtigheid/100","v":535.51800000000003},"kg","Hout_Water"]
[null,"Totale massa",null,{"$f":"Hout_Massa+Hout_Water","v":1071.0360000000001},"kg","Hout_Massa_Water",null,null,null,null,null,null,null,null,null,null,"Brennwert (Ho)","Ho der Trockensubstanz (TS)","MJ/kg TS",null,null,19.322848199999999,{"$f":"Hout_HHVds-V101","v":-2.2848199999998542E-2}]
[null,null,null,null,null,null,null,null,null,null,null,null,null,null,null,null,null,"Ho der TS","kWh/kg TS",null,null,5.3674578333333329]
[null,"Volume soort",null,{"$f":"Hout_Vorm","v":"Top- en takhout"},"-","Hout_Vorm",null,null,null,null,null,null,null,null,null,null,"Heizwert (Hu)","Hu der TS ","MJ/kg TS",null,null,18,{"$f":"Hout_LHVds-V103","v":1.3000000000000007}]
[null,"Volume Type Factor",null,{"$f":"LOOKUP(Hout_Vorm,Lijst_Volume_Vorm,Lijst_Volume_Vorm_Factor)","v":0.3},"m3/m3","Hout_Vorm_Vulling",null,null,null,null,null,null,null,null,null,null,null,"Hu der TS","kWh/kg TS",null,null,5]
[null,"RHO bij Volume Factor",null,{"$f":"Hout_RHO_VF1*Hout_Vorm_Vulling","v":321.31080000000003},"kg/m3","Hout_RHO",null,null,null,null,null,null,null,null,null,null,null,"Hu der Frischsubstanz (FS)","MJ/kg FS",null,null,7.7765000000000004,{"$f":"Hout_LHVm-V105","v":1.8734999999999999}]
[null,"Asgehalte",null,{"$f":"LOOKUP(Hout_Vorm,Lijst_Volume_Vorm,Lijst_Hout_Asgehalte)","v":2},"%","Hout_Asgehalte",null,null,null,null,null,null,null,null,null,null,null,"Hu der FS ","kWh/kg FS",null,null,2.1601388888888891]
[null,null,null,null,null,null,null,null,null,null,null,null,null,null,null,null,null,"Hu der FS","MJ/m³ FS",null,null,3642.3881760000004,{"$f":"Hout_LHVv-V107/1000","v":-0.5417389560000001}]
[null,"HHV-ds",null,{"$f":"LOOKUP(Hout_Soort,Lijst_Hout_Soort,Lijst_Hout_HHVds)","v":19.3},"GJ/ton","Hout_HHVds",null,null,null,null,null,null,null,null,null,null,null,"Hu der FS","kWh/m³ FS",null,null,1011.7744933333335]
[null,"H2",null,{"$f":"LOOKUP(Hout_Soort,Lijst_Hout_Soort,Lijst_Hout_H2)","v":6},"%","Hout_H2"]
[null,"Berekening LHVds",null,{"$f":"LHV_Vochtigheid","v":1},"-","LHV_Vochtigheid"]
[null,"Berekening LHVds",null,{"$f":"LHV_Vochtigheid_Verdampingswarmte","v":0},null,"LHV_Vochtigheid_Verdampingswarmte"]
[null,"Berekening LHVds",null,{"$f":"LHV_Vochtigheid_Verdampingswarmte_H2","v":0},null,"LHV_Vochtigheid_Verdampingswarmte_H2"]
[null,"LHV-ds",null,{"$f":"Hout_HHVds","v":19.3},"GJ/tonds","Hout_LHVds",null,null,null,null,null,null,null,null,null,null,"Dichte","Mittlere Darrdichte","kg/m³ (bei 0 % H2O)",null,null,680,{"$f":"Hout_RHO_0-V113","v":-47}]
[null,"LHVm",null,{"$f":"LHV_Vochtigheid*Hout_HHVds*(1-Hout_Vochtigheid/100)\n-LHV_Vochtigheid_Verdampingswarmte*2.447*Hout_Vochtigheid/100\n-LHV_Vochtigheid_Verdampingswarmte_H2*Hout_H2/(100*2)*18.02*2.447*(1-Hout_Vochtigheid/100)","v":9.65},"GJ/ton","Hout_LHVm",null,null,null,null,null,null,null,null,null,null,null,"Mittleres Schwindmaß","%",null,null,13.9]
[null,"LHVv",null,{"$f":"Hout_LHVm*Hout_RHO/1000","v":3.1006492200000002},"GJ/m3","Hout_LHVv",null,null,null,null,null,null,null,null,null,null,null,"Roh- bzw. Lagerungsdichte","kg/m³ (bei x % H2O)",null,null,468.38400000000001,{"$f":"Hout_RHO-V115","v":-147.07319999999999}]
[null,null,null,null,null,null,null,null,null,null,null,null,null,null,null,null,null," - Anteil der Holzsubstanz","kg/m³ (TS-Anteil bei x % H2O)",null,null,234.19200000000001]
[null,null,null,{"$f":"IF(Hout_LHVv_Dim=\"GJ/m3\",Hout_LHVv,Hout_LHVv/3.6)","v":0.86129145000000007},{"$f":"Hout_LHVv_Dim","v":"MWh/m3"},"Uit_Hout_LHVv",null,null,null,null,null,null,null,null,null,null,null," - Anteil des Wassers","kg/m³ (H2O-Anteil bei x % H2O)",null,null,234.19200000000001]
[null,null,null,{"$f":"IF(Hout_LHVm_Dim=\"GJ/ton\",Hout_LHVm,\nIF(Hout_LHVm_Dim=\"MWh/ton\",Hout_LHVm/3.6,\nIF(Hout_LHVm_Dim=\"GJ/tonds\",Hout_LHVds,\nIF(Hout_LHVm_Dim=\"MWh/tonds\",Hout_LHVds/3.6,\"berekening LHVm\"))))","v":9.65},{"$f":"Hout_LHVm_Dim","v":"GJ/ton"},"Uit_Hout_LHVm",null,null,null,null,null,null,null,null,null,null,null,"Verhältniszahl m³ pro t FS","m³/t FS",null,null,2.1350003416000547]
[]
[null,null,null,null,null,null,null,null,null,null,null,null,null,null,null,null,"Aschenanfall","Aschengehalt (Schätzwert)","% (Gewicht, TS)",null,null,1.5]
[null,"Hout - Doorzet",{"$f":"ROW()","v":121},null,null,null,null,null,null,null,null,null,null,null,"Doorzet",null,null,"Aschendichte (Schätzwert)","kg/m³",null,null,700]
[]
[null,"Doorzet",null,{"$f":"Hout_Doorzet_Oogst_Eindgebruiker","v":10000},null,"Hout_Doorzet_Oogst_Eindgebruiker"]
[null,"Doorzet_Dim",null,{"$f":"Hout_Doorzet_Dim","v":"m3"},null,"Hout_Doorzet_Dim"]
[null,null,null,null,null,null,null,null,null,null,null,null,null,"Controle"]
[null,"Doorzet",null,{"$f":"Uit_Hout_Doorzet_Oogst_Eindgebruiker_GJ/Hout_LHVv","v":10000},"m3","Uit_Hout_Doorzet_m3",null,null,null,null,null,null,null,{"$f":"Uit_Hout_Doorzet_Oogst_Eindgebruiker_m3*Hout_LHVv","v":31006.492200000001},"GJ"]
[null,"Doorzet",null,{"$f":"Uit_Hout_Doorzet_Oogst_Eindgebruiker_GJ/Hout_LHVm*1000","v":3213107.9999999995},"kg","Uit_Hout_Doorzet_kg",null,null,null,null,null,null,null,{"$f":"Uit_Hout_Doorzet_Oogst_Eindgebruiker_kg*Hout_LHVm/1000","v":31006.492199999997},"GJ"]
[null,"Doorzet",null,{"$f":"Uit_Hout_Doorzet_Oogst_Eindgebruiker_kg*(1-Hout_Vochtigheid/100)","v":1606553.9999999998},"kgds","Uit_Hout_Doorzet_Oogst_Eindgebruiker_kgds",null,null,null,null,null,null,null,{"$f":"Uit_Hout_Doorzet_Oogst_Eindgebruiker_kgds/(1-Hout_Vochtigheid/100)*Hout_LHVm/1000","v":31006.492199999997},"GJ"]
[null,"Doorzet",null,{"$f":"Uit_Hout_Doorzet_Oogst_Eindgebruiker_GJ/Hout_LHVm","v":3213.1079999999997},"ton","Uit_Hout_Doorzet_Oogst_Eindgebruiker_ton",null,null,null,null,null,null,null,{"$f":"Uit_Hout_Doorzet_Oogst_Eindgebruiker_ton*Hout_LHVm","v":31006.492199999997},"GJ"]
[null,"Doorzet",null,{"$f":"Uit_Hout_Doorzet_Oogst_Eindgebruiker_GJ/Hout_LHVds","v":1606.5539999999999},"tonds","Uit_Hout_Doorzet_Oogst_Eindgebruiker_tonds",null,null,null,null,null,null,null,{"$f":"Uit_Hout_Doorzet_Oogst_Eindgebruiker_GJ","v":31006.492200000001},"GJ"]
[null,"Doorzet",null,{"$f":"IF(Hout_Doorzet_Dim=\"m3\",Hout_Doorzet_Oogst_Eindgebruiker*Hout_LHVv,\nIF(Hout_Doorzet_Dim=\"kg\",Hout_Doorzet_Oogst_Eindgebruiker*Hout_LHVm/1000,\nIF(Hout_Doorzet_Dim=\"kgds\",Hout_Doorzet_Oogst_Eindgebruiker*Hout_LHVds/1000,\nIF(Hout_Doorzet_Dim=\"ton\",Hout_Doorzet_Oogst_Eindgebruiker*Hout_LHVm,\nIF(Hout_Doorzet_Dim=\"tonds\",Hout_Doorzet_Oogst_Eindgebruiker*Hout_LHVds,\nIF(Hout_Doorzet_Dim=\"MJ\",Hout_Doorzet_Oogst_Eindgebruiker/1000,\nIF(Hout_Doorzet_Dim=\"GJ\",Hout_Doorzet_Oogst_Eindgebruiker,\nIF(Hout_Doorzet_Dim=\"kWh\",Hout_Doorzet_Oogst_Eindgebruiker*3.6/1000,\nIF(Hout_Doorzet_Dim=\"MWh\",Hout_Doorzet_Oogst_Eindgebruiker*3.6)))))))))","v":31006.492200000001},"GJ","Uit_Hout_Doorzet_Oogst_Eindgebruiker_GJ",null,"<--De doorzet wordt in eerste instantie berekend voor GJ",null,null,null,null,null,{"$f":"Uit_Hout_Doorzet_Oogst_Eindgebruiker_GJ","v":31006.492200000001},"GJ"]
[null,"Doorzet",null,{"$f":"Uit_Hout_Doorzet_Oogst_Eindgebruiker_GJ*1000","v":31006492.199999999},"MJ","Uit_Hout_Doorzet_Oogst_Eindgebruiker_MJ",null,"Daaruit worden de andere dimensies berekend",null,null,null,null,null,{"$f":"Uit_Hout_Doorzet_Oogst_Eindgebruiker_MJ/1000","v":31006.492200000001},"GJ"]
[null,"Doorzet",null,{"$f":"Uit_Hout_Doorzet_Oogst_Eindgebruiker_GJ/3.6","v":8612.9145000000008},"MWh","Uit_Hout_Doorzet_Oogst_Eindgebruiker_MWh",null,null,null,null,null,null,null,{"$f":"Uit_Hout_Doorzet_Oogst_Eindgebruiker_MWh*3.6","v":31006.492200000004},"GJ"]
[null,"Doorzet",null,{"$f":"Uit_Hout_Doorzet_Oogst_Eindgebruiker_GJ/3.6*1000","v":8612914.5},"kWh","Uit_Hout_Doorzet_Oogst_Eindgebruiker_kWh",null,null,null,null,null,null,null,{"$f":"Uit_Hout_Doorzet_Oogst_Eindgebruiker_kWh*3.6/1000","v":31006.492200000001},"GJ"]
[]
[null,null,null,{"$f":"IF(Hout_Oogst_Eindgebruiker=\"naar eindgebruiker\",\"tonds\",Hout_Doorzet_Dim)","v":"tonds"}]
[null,null,null,{"$f":"IF(Hout_Oogst_Eindgebruiker=\"naar eindgebruiker\",Uit_Proces_Doorzet_tonds/((100+Proces_Houtverlies)/100),Hout_Doorzet_Oogst_Eindgebruiker)","v":1803.2748979591836},null,"Hout_Doorzet"]
[]
[]
[null,"Doorzet",null,{"$f":"Uit_Hout_Doorzet_GJ/Hout_LHVv","v":11224.489795918365},"m3","Uit_Hout_Doorzet_m3",null,null,null,null,null,null,null,"Controle"]
[null,"Doorzet",null,{"$f":"Uit_Hout_Doorzet_GJ/Hout_LHVm*1000","v":3606549.7959183669},"kg","Uit_Hout_Doorzet_kg",null,null,null,null,null,null,null,{"$f":"Uit_Hout_Doorzet_m3*Hout_LHVv","v":34803.205530612242},"GJ"]
[null,"Doorzet",null,{"$f":"Uit_Hout_Doorzet_kg*(1-Hout_Vochtigheid/100)","v":1803274.8979591834},"kgds","Uit_Hout_Doorzet_kgds",null,null,null,null,null,null,null,{"$f":"Uit_Hout_Doorzet_kg*Hout_LHVm/1000","v":34803.205530612242},"GJ"]
[null,"Doorzet",null,{"$f":"Uit_Hout_Doorzet_GJ/Hout_LHVm","v":3606.5497959183667},"ton","Uit_Hout_Doorzet_ton",null,null,null,null,null,null,null,{"$f":"Uit_Hout_Doorzet_kgds/(1-Hout_Vochtigheid/100)*Hout_LHVm/1000","v":34803.205530612242},"GJ"]
[null,"Doorzet",null,{"$f":"Uit_Hout_Doorzet_GJ/Hout_LHVds","v":1803.2748979591834},"tonds","Uit_Hout_Doorzet_tonds",null,null,null,null,null,null,null,{"$f":"Uit_Hout_Doorzet_ton*Hout_LHVm","v":34803.205530612242},"GJ"]
[null,"Doorzet",null,{"$f":"IF(D136=\"m3\",Hout_Doorzet*Hout_LHVv,\nIF(D136=\"kg\",Hout_Doorzet*Hout_LHVm/1000,\nIF(D136=\"kgds\",Hout_Doorzet*Hout_LHVds/1000,\nIF(D136=\"ton\",Hout_Doorzet*Hout_LHVm,\nIF(D136=\"tonds\",Hout_Doorzet*Hout_LHVds,\nIF(D136=\"MJ\",Hout_Doorzet/1000,\nIF(D136=\"GJ\",Hout_Doorzet,\nIF(D136=\"kWh\",Hout_Doorzet*3.6/1000,\nIF(D136=\"MWh\",Hout_Doorzet*3.6)))))))))","v":34803.205530612242},"GJ","Uit_Hout_Doorzet_GJ",null,"<--De doorzet wordt in eerste instantie berekend voor GJ",null,null,null,null,null,{"$f":"Uit_Hout_Doorzet_tonds*Hout_LHVds","v":34803.205530612242},"GJ"]
[null,"Doorzet",null,{"$f":"Uit_Hout_Doorzet_GJ*1000","v":34803205.530612245},"MJ","Uit_Hout_Doorzet_MJ",null,"Daaruit worden de andere dimensies berekend",null,null,null,null,null,{"$f":"Uit_Hout_Doorzet_GJ","v":34803.205530612242},"GJ"]
[null,"Doorzet",null,{"$f":"Uit_Hout_Doorzet_GJ/3.6","v":9667.5570918367339},"MWh","Uit_Hout_Doorzet_MWh",null,null,null,null,null,null,null,{"$f":"Uit_Hout_Doorzet_MJ/1000","v":34803.205530612242},"GJ"]
[null,"Doorzet",null,{"$f":"Uit_Hout_Doorzet_GJ/3.6*1000","v":9667557.0918367337},"kWh","Uit_Hout_Doorzet_kWh",null,null,null,null,null,null,null,{"$f":"Uit_Hout_Doorzet_MWh*3.6","v":34803.205530612242},"GJ"]
[null,null,null,null,null,null,null,null,null,null,null,null,null,{"$f":"Uit_Hout_Doorzet_kWh*3.6/1000","v":34803.205530612242},"GJ"]
[]
[null,"Doorzet_Dim",null,{"$f":"Uit_Hout_Doorzet_MV_Dim","v":"ton"},null,"Uit_Hout_Doorzet_MV_Dim"]
[null,"Doorzet_MV",null,{"$f":"IF(Uit_Hout_Doorzet_MV_Dim=\"kg\",Uit_Hout_Doorzet_kg,\nIF(Uit_Hout_Doorzet_MV_Dim=\"kgds\",Uit_Hout_Doorzet_kgds,\nIF(Uit_Hout_Doorzet_MV_Dim=\"liter\",Uit_Hout_Doorzet_liter,\nIF(Uit_Hout_Doorzet_MV_Dim=\"m3\",Uit_Hout_Doorzet_m3,\nIF(Uit_Hout_Doorzet_MV_Dim=\"ton\",Uit_Hout_Doorzet_ton,\nIF(Uit_Hout_Doorzet_MV_Dim=\"tonds\",Uit_Hout_Doorzet_tonds))))))","v":3606.5497959183667},null,"Uit_Hout_Doorzet_MV"]
[]
[null,"Doorzet_Dim",null,{"$f":"Uit_Hout_Doorzet_E_Dim","v":"GJ"},null,"Uit_Hout_Doorzet_E_Dim"]
[null,"Doorzet_E",null,{"$f":"IF(Uit_Hout_Doorzet_E_Dim=\"GJ\",Uit_Hout_Doorzet_GJ,\nIF(Uit_Hout_Doorzet_E_Dim=\"MWh\",Uit_Hout_Doorzet_MWh,\nIF(Uit_Hout_Doorzet_E_Dim=\"MJ\",Uit_Hout_Doorzet_MJ,\nIF(Uit_Hout_Doorzet_E_Dim=\"kWh\",Uit_Hout_Doorzet_MWh*1000))))","v":34803.205530612242},null,"Uit_Hout_Doorzet_E"]
[]
[]
[null,"Keten",{"$f":"ROW()","v":158},null,null,null,null,null,null,null,null,null,null,null,{"$f":"B158","v":"Keten"}]
[]
[]
[null,"Hout keten",null,{"$f":"Hout_Keten_NL","v":"1a-Chips uit top- en tak hout uit bos of landschap"}]
[null,null,null,"NL","EU"]
[null,"CO2 productie Cultivatie",null,{"$f":"VLOOKUP(Hout_Keten_NL,Lijst_NL_Keten,Keten_Cultivatie_CO2)","v":0},{"$f":"VLOOKUP(Hout_Keten_EU,Lijst_EU_Keten,Keten_Cultivatie_CO2)","v":0},"gCO2/MJ","Keten_NL_Cultivatie_CO2",null,null,"Keten_EU_Cultivatie_CO2",null,null,null,"gCO2eq/MJ"]
[null,"CO2 productie Proces",null,{"$f":"VLOOKUP(Hout_Keten_NL,Lijst_NL_Keten,Keten_Proces_CO2)","v":1.5164366759002779},{"$f":"VLOOKUP(Hout_Keten_EU,Lijst_EU_Keten,Keten_Proces_CO2)","v":1.8407965330386269},"gCO2/MJ","Keten_NL_Proces_CO2",null,null,"Keten_EU_Proces_CO2",null,null,null,"gCO2eq/tonds"]
[null,"CO2 productie Transport",null,{"$f":"VLOOKUP(Hout_Keten_NL,Lijst_NL_Keten,Keten_Transport_CO2)","v":0.89013599999999993},{"$f":"VLOOKUP(Hout_Keten_EU,Lijst_EU_Keten,Keten_Transport_CO2)","v":3},"gCO2/MJ","Keten_NL_Transport_CO2",null,null,"Keten_EU_Transport_CO2",null,null,null,"kgCO2eq"]
[null,"CO2 productie Verbranding",null,{"$f":"VLOOKUP(Hout_Keten_NL,Lijst_NL_Keten,Keten_Verbranding_CO2)","v":0.41358188387},{"$f":"VLOOKUP(Hout_Keten_EU,Lijst_EU_Keten,Keten_Verbranding_CO2)","v":0.41358188387},"gCO2/MJ","Keten_NL_Verbranding_CO2",null,null,"Keten_EU_Verbranding_CO2",null,null,null,"tonCO2eq"]
[null,"CO2 Totaal ex Verbranding",null,{"$f":"Keten_NL_Cultivatie_CO2+Keten_NL_Proces_CO2+Keten_NL_Transport_CO2","v":2.4065726759002777},{"$f":"IF(Keten_EU_Cultivatie_CO2=\"n.a.\",\"n.a.\",Keten_EU_Cultivatie_CO2+Keten_EU_Proces_CO2+Keten_EU_Transport_CO2)","v":4.8407965330386267},"gCO2/MJ","Keten_NL_Totaal_CO2",null,null,"Keten_EU_Totaal_CO2",null,null,null,"MtonCO2eq"]
[]
[null,"CO2 productie",null,{"$f":"Uit_NL_EU_Keten_CO2_Dim","v":"gCO2eq/MJ"},null,"Uit_NL_EU_Keten_CO2_Dim\n"]
[null,"CO2 productie Cultivatie",null,{"$f":"IF(Uit_NL_EU_Keten_CO2_Dim=\"gCO2eq/MJ\",Keten_NL_Cultivatie_CO2,\nIF(Uit_NL_EU_Keten_CO2_Dim=\"kgCO2eq/tonds\",Keten_NL_Cultivatie_CO2*JRC_Basis_Hout_LHVm,\nIF(Uit_NL_EU_Keten_CO2_Dim=\"kgCO2eq\",Keten_NL_Cultivatie_CO2/1000*Uit_Hout_Doorzet_GJ*1000,\nIF(Uit_NL_EU_Keten_CO2_Dim=\"tonCO2eq\",Keten_NL_Cultivatie_CO2/1000/1000*Uit_Hout_Doorzet_GJ*1000,\nIF(Uit_NL_EU_Keten_CO2_Dim=\"MtonCO2eq\",Keten_NL_Cultivatie_CO2/1000/1000/1000*Uit_Hout_Doorzet_GJ*1000)))))","v":0},{"$f":"IF(Keten_EU_Cultivatie_CO2=\"n.a.\",\"n.a.\",\nIF(Uit_NL_EU_Keten_CO2_Dim=\"gCO2eq/MJ\",Keten_EU_Cultivatie_CO2,\nIF(Uit_NL_EU_Keten_CO2_Dim=\"kgCO2eq/tonds\",Keten_EU_Cultivatie_CO2*JRC_Basis_Hout_LHVm,\nIF(Uit_NL_EU_Keten_CO2_Dim=\"kgCO2eq\",Keten_EU_Cultivatie_CO2/1000*Uit_Hout_Doorzet_GJ*1000,\nIF(Uit_NL_EU_Keten_CO2_Dim=\"tonCO2eq\",Keten_EU_Cultivatie_CO2/1000/1000*Uit_Hout_Doorzet_GJ*1000,\nIF(Uit_NL_EU_Keten_CO2_Dim=\"MtonCO2eq\",Keten_EU_Cultivatie_CO2/1000/1000/1000*Uit_Hout_Doorzet_GJ*1000))))))","v":0},{"$f":"Uit_NL_EU_Keten_CO2_Dim","v":"gCO2eq/MJ"},"Uit_NL_Keten_Cultivatie_CO2",null,null,"Uit_EU_Keten_Cultivatie_CO2"]
[null,"CO2 productie Proces",null,{"$f":"IF(Uit_NL_EU_Keten_CO2_Dim=\"gCO2eq/MJ\",Keten_NL_Proces_CO2,\nIF(Uit_NL_EU_Keten_CO2_Dim=\"kgCO2eq/tonds\",Keten_NL_Proces_CO2*JRC_Basis_Hout_LHVm,\nIF(Uit_NL_EU_Keten_CO2_Dim=\"kgCO2eq\",Keten_NL_Proces_CO2/1000*Uit_Hout_Doorzet_GJ*1000,\nIF(Uit_NL_EU_Keten_CO2_Dim=\"tonCO2eq\",Keten_NL_Proces_CO2/1000/1000*Uit_Hout_Doorzet_GJ*1000,\nIF(Uit_NL_EU_Keten_CO2_Dim=\"MtonCO2eq\",Keten_NL_Proces_CO2/1000/1000/1000*Uit_Hout_Doorzet_GJ*1000)))))","v":1.5164366759002779},{"$f":"IF(Keten_EU_Proces_CO2=\"n.a.\",\"n.a.\",\nIF(Uit_NL_EU_Keten_CO2_Dim=\"gCO2eq/MJ\",Keten_EU_Proces_CO2,\nIF(Uit_NL_EU_Keten_CO2_Dim=\"kgCO2eq/tonds\",Keten_EU_Proces_CO2*JRC_Basis_Hout_LHVm,\nIF(Uit_NL_EU_Keten_CO2_Dim=\"kgCO2eq\",Keten_EU_Proces_CO2/1000*Uit_Hout_Doorzet_GJ*1000,\nIF(Uit_NL_EU_Keten_CO2_Dim=\"tonCO2eq\",Keten_EU_Proces_CO2/1000/1000*Uit_Hout_Doorzet_GJ*1000,\nIF(Uit_NL_EU_Keten_CO2_Dim=\"MtonCO2eq\",Keten_EU_Proces_CO2/1000/1000/1000*Uit_Hout_Doorzet_GJ*1000))))))","v":1.8407965330386269},{"$f":"Uit_NL_EU_Keten_CO2_Dim","v":"gCO2eq/MJ"},"Uit_NL_Keten_Proces_CO2",null,null,"Uit_EU_Keten_Proces_CO2"]
[null,"CO2 productie Transport",null,{"$f":"IF(Uit_NL_EU_Keten_CO2_Dim=\"gCO2eq/MJ\",Keten_NL_Transport_CO2,\nIF(Uit_NL_EU_Keten_CO2_Dim=\"kgCO2eq/tonds\",Keten_NL_Transport_CO2*JRC_Basis_Hout_LHVm,\nIF(Uit_NL_EU_Keten_CO2_Dim=\"kgCO2eq\",Keten_NL_Transport_CO2/1000*Uit_Hout_Doorzet_GJ*1000,\nIF(Uit_NL_EU_Keten_CO2_Dim=\"tonCO2eq\",Keten_NL_Transport_CO2/1000/1000*Uit_Hout_Doorzet_GJ*1000,\nIF(Uit_NL_EU_Keten_CO2_Dim=\"MtonCO2eq\",Keten_NL_Transport_CO2/1000/1000/1000*Uit_Hout_Doorzet_GJ*1000)))))","v":0.89013599999999993},{"$f":"IF(Keten_EU_Transport_CO2=\"n.a.\",\"n.a.\",\nIF(Uit_NL_EU_Keten_CO2_Dim=\"gCO2eq/MJ\",Keten_EU_Transport_CO2,\nIF(Uit_NL_EU_Keten_CO2_Dim=\"kgCO2eq/tonds\",Keten_EU_Transport_CO2*JRC_Basis_Hout_LHVm,\nIF(Uit_NL_EU_Keten_CO2_Dim=\"kgCO2eq\",Keten_EU_Transport_CO2/1000*Uit_Hout_Doorzet_GJ*1000,\nIF(Uit_NL_EU_Keten_CO2_Dim=\"tonCO2eq\",Keten_EU_Transport_CO2/1000/1000*Uit_Hout_Doorzet_GJ*1000,\nIF(Uit_NL_EU_Keten_CO2_Dim=\"MtonCO2eq\",Keten_EU_Transport_CO2/1000/1000/1000*Uit_Hout_Doorzet_GJ*1000))))))","v":3},{"$f":"Uit_NL_EU_Keten_CO2_Dim","v":"gCO2eq/MJ"},"Uit_NL_Keten_Transport_CO2",null,null,"Uit_EU_Keten_Transport_CO2"]
[null,"CO2 Totaal - Verbranding",null,{"$f":"IF(Uit_NL_EU_Keten_CO2_Dim=\"gCO2eq/MJ\",Keten_NL_Verbranding_CO2,\nIF(Uit_NL_EU_Keten_CO2_Dim=\"kgCO2eq/tonds\",Keten_NL_Verbranding_CO2*JRC_Basis_Hout_LHVm,\nIF(Uit_NL_EU_Keten_CO2_Dim=\"kgCO2eq\",Keten_NL_Verbranding_CO2/1000*Uit_Hout_Doorzet_GJ*1000,\nIF(Uit_NL_EU_Keten_CO2_Dim=\"tonCO2eq\",Keten_NL_Verbranding_CO2/1000/1000*Uit_Hout_Doorzet_GJ*1000,\nIF(Uit_NL_EU_Keten_CO2_Dim=\"MtonCO2eq\",Keten_NL_Verbranding_CO2/1000/1000/1000*Uit_Hout_Doorzet_GJ*1000)))))","v":0.41358188387},{"$f":"IF(Keten_EU_Verbranding_CO2=\"n.a.\",\"n.a.\",\nIF(Uit_NL_EU_Keten_CO2_Dim=\"gCO2eq/MJ\",Keten_EU_Verbranding_CO2,\nIF(Uit_NL_EU_Keten_CO2_Dim=\"kgCO2eq/tonds\",Keten_EU_Verbranding_CO2*JRC_Basis_Hout_LHVm,\nIF(Uit_NL_EU_Keten_CO2_Dim=\"kgCO2eq\",Keten_EU_Verbranding_CO2/1000*Uit_Hout_Doorzet_GJ*1000,\nIF(Uit_NL_EU_Keten_CO2_Dim=\"tonCO2eq\",Keten_EU_Verbranding_CO2/1000/1000*Uit_Hout_Doorzet_GJ*1000,\nIF(Uit_NL_EU_Keten_CO2_Dim=\"MtonCO2eq\",Keten_EU_Verbranding_CO2/1000/1000/1000*Uit_Hout_Doorzet_GJ*1000))))))","v":0.41358188387},{"$f":"Uit_NL_EU_Keten_CO2_Dim","v":"gCO2eq/MJ"},"Uit_NL_Keten_Verbranding_CO2",null,null,"Uit_EU_Keten_Verbranding_CO2"]
[null,"CO2 Totaal ex Verbranding",null,{"$f":"Uit_NL_Keten_Cultivatie_CO2+Uit_NL_Keten_Proces_CO2+Uit_NL_Keten_Transport_CO2","v":2.4065726759002777},{"$f":"IF(Uit_EU_Keten_Cultivatie_CO2=\"n.a.\",\"n.a.\",Uit_EU_Keten_Cultivatie_CO2+Uit_EU_Keten_Proces_CO2+Uit_EU_Keten_Transport_CO2)","v":4.8407965330386267},{"$f":"Uit_NL_EU_Keten_CO2_Dim","v":"gCO2eq/MJ"}]
[null,null,null,"NL","EU"]
[null,"CO2 productie stap 1",null,{"$f":"VLOOKUP(Hout_Keten_NL,Lijst_NL_Keten,Keten_Stap1_CO2eq+0*Keten_Delta)","v":0.77894736842105305},{"$f":"VLOOKUP(Hout_Keten_EU,Lijst_EU_Keten,Keten_Stap1_CO2eq+0*Keten_Delta)","v":1.462339543038627},"gCO2/MJ","Keten_NL_Stap1_CO2",null,null,"Keten_EU_Stap1_CO2"]
[null,"CO2 productie stap 2",null,{"$f":"VLOOKUP(Hout_Keten_NL,Lijst_NL_Keten,Keten_Stap1_CO2eq+1*Keten_Delta)","v":0},{"$f":"VLOOKUP(Hout_Keten_EU,Lijst_EU_Keten,Keten_Stap1_CO2eq+1*Keten_Delta)","v":0},"gCO2/MJ","Keten_NL_Stap2_CO2",null,null,"Keten_EU_Stap2_CO2"]
[null,"CO2 productie stap 3",null,{"$f":"VLOOKUP(Hout_Keten_NL,Lijst_NL_Keten,Keten_Stap1_CO2eq+2*Keten_Delta)","v":0.73684210526315785},{"$f":"VLOOKUP(Hout_Keten_EU,Lijst_EU_Keten,Keten_Stap1_CO2eq+2*Keten_Delta)","v":0.37845698999999994},"gCO2/MJ","Keten_NL_Stap3_CO2",null,null,"Keten_EU_Stap3_CO2"]
[null,"CO2 productie stap 4",null,{"$f":"VLOOKUP(Hout_Keten_NL,Lijst_NL_Keten,Keten_Stap1_CO2eq+3*Keten_Delta)","v":0.88947368421052619},{"$f":"VLOOKUP(Hout_Keten_EU,Lijst_EU_Keten,Keten_Stap1_CO2eq+3*Keten_Delta)","v":3},"gCO2/MJ","Keten_NL_Stap4_CO2",null,null,"Keten_EU_Stap4_CO2"]
[null,"CO2 productie stap 5",null,{"$f":"VLOOKUP(Hout_Keten_NL,Lijst_NL_Keten,Keten_Stap1_CO2eq+4*Keten_Delta)","v":0},{"$f":"VLOOKUP(Hout_Keten_EU,Lijst_EU_Keten,Keten_Stap1_CO2eq+4*Keten_Delta)","v":0},"gCO2/MJ","Keten_NL_Stap5_CO2",null,null,"Keten_EU_Stap5_CO2"]
[null,"CO2 productie stap 6",null,{"$f":"VLOOKUP(Hout_Keten_NL,Lijst_NL_Keten,Keten_Stap1_CO2eq+5*Keten_Delta)","v":0},{"$f":"VLOOKUP(Hout_Keten_EU,Lijst_EU_Keten,Keten_Stap1_CO2eq+5*Keten_Delta)","v":0},"gCO2/MJ","Keten_NL_Stap6_CO2",null,null,"Keten_EU_Stap6_CO2"]
[null,"CO2 productie stap 7",null,{"$f":"VLOOKUP(Hout_Keten_NL,Lijst_NL_Keten,Keten_Stap1_CO2eq+6*Keten_Delta)","v":0},{"$f":"VLOOKUP(Hout_Keten_EU,Lijst_EU_Keten,Keten_Stap1_CO2eq+6*Keten_Delta)","v":0},"gCO2/MJ","Keten_NL_Stap7_CO2",null,null,"Keten_EU_Stap7_CO2"]
[null,null,null,{"$f":"Keten_NL_Stap1_CO2+Keten_NL_Stap2_CO2+Keten_NL_Stap3_CO2+Keten_NL_Stap4_CO2+Keten_NL_Stap5_CO2+Keten_NL_Stap6_CO2","v":2.405263157894737},{"$f":"Keten_EU_Stap1_CO2+Keten_EU_Stap2_CO2+Keten_EU_Stap3_CO2+Keten_EU_Stap4_CO2+Keten_EU_Stap5_CO2+Keten_EU_Stap6_CO2","v":4.8407965330386267},null,"Keten_NL_Stap1_6_CO2",null,null,"Keten_EU_Stap1_6_CO2"]
[]
[null,null,null,{"$f":"Uit_NL_EU_Keten_CO2_Dim","v":"gCO2eq/MJ"}]
[null,"CO2 productie stap 1",null,{"$f":"IF(Uit_NL_EU_Keten_CO2_Dim=\"gCO2eq/MJ\",Keten_NL_Stap1_CO2,\nIF(Uit_NL_EU_Keten_CO2_Dim=\"kgCO2eq/tonds\",Keten_NL_Stap1_CO2*JRC_Basis_Hout_LHVm,\nIF(Uit_NL_EU_Keten_CO2_Dim=\"kgCO2eq\",Keten_NL_Stap1_CO2/1000*Uit_Hout_Doorzet_GJ*1000,\nIF(Uit_NL_EU_Keten_CO2_Dim=\"tonCO2eq\",Keten_NL_Stap1_CO2/1000/1000*Uit_Hout_Doorzet_GJ*1000,\nIF(Uit_NL_EU_Keten_CO2_Dim=\"MtonCO2eq\",Keten_NL_Stap1_CO2/1000/1000/1000*Uit_Hout_Doorzet_GJ*1000)))))","v":0.77894736842105305},{"$f":"IF(Uit_NL_EU_Keten_CO2_Dim=\"gCO2eq/MJ\",Keten_EU_Stap1_CO2,\nIF(Uit_NL_EU_Keten_CO2_Dim=\"kgCO2eq/tonds\",Keten_EU_Stap1_CO2*JRC_Basis_Hout_LHVm,\nIF(Uit_NL_EU_Keten_CO2_Dim=\"kgCO2eq\",Keten_EU_Stap1_CO2/1000*Uit_Hout_Doorzet_GJ*1000,\nIF(Uit_NL_EU_Keten_CO2_Dim=\"tonCO2eq\",Keten_EU_Stap1_CO2/1000/1000*Uit_Hout_Doorzet_GJ*1000,\nIF(Uit_NL_EU_Keten_CO2_Dim=\"MtonCO2eq\",Keten_EU_Stap1_CO2/1000/1000/1000*Uit_Hout_Doorzet_GJ*1000)))))","v":1.462339543038627},{"$f":"Uit_NL_EU_Keten_CO2_Dim","v":"gCO2eq/MJ"},"Uit_NL_Keten_Stap1_CO2",null,null,"Uit_EU_Keten_Stap1_CO2"]
[null,"CO2 productie stap 2",null,{"$f":"IF(Uit_NL_EU_Keten_CO2_Dim=\"gCO2eq/MJ\",Keten_NL_Stap2_CO2,\nIF(Uit_NL_EU_Keten_CO2_Dim=\"kgCO2eq/tonds\",Keten_NL_Stap2_CO2*JRC_Basis_Hout_LHVm,\nIF(Uit_NL_EU_Keten_CO2_Dim=\"kgCO2eq\",Keten_NL_Stap2_CO2/1000*Uit_Hout_Doorzet_GJ*1000,\nIF(Uit_NL_EU_Keten_CO2_Dim=\"tonCO2eq\",Keten_NL_Stap2_CO2/1000/1000*Uit_Hout_Doorzet_GJ*1000,\nIF(Uit_NL_EU_Keten_CO2_Dim=\"MtonCO2eq\",Keten_NL_Stap2_CO2/1000/1000/1000*Uit_Hout_Doorzet_GJ*1000)))))","v":0},{"$f":"IF(Uit_NL_EU_Keten_CO2_Dim=\"gCO2eq/MJ\",Keten_EU_Stap2_CO2,\nIF(Uit_NL_EU_Keten_CO2_Dim=\"kgCO2eq/tonds\",Keten_EU_Stap2_CO2*JRC_Basis_Hout_LHVm,\nIF(Uit_NL_EU_Keten_CO2_Dim=\"kgCO2eq\",Keten_EU_Stap2_CO2/1000*Uit_Hout_Doorzet_GJ*1000,\nIF(Uit_NL_EU_Keten_CO2_Dim=\"tonCO2eq\",Keten_EU_Stap2_CO2/1000/1000*Uit_Hout_Doorzet_GJ*1000,\nIF(Uit_NL_EU_Keten_CO2_Dim=\"MtonCO2eq\",Keten_EU_Stap2_CO2/1000/1000/1000*Uit_Hout_Doorzet_GJ*1000)))))","v":0},"gCO2eq/MJ","Uit_NL_Keten_Stap2_CO2",null,null,"Uit_EU_Keten_Stap2_CO2"]
[null,"CO2 productie stap 3",null,{"$f":"IF(Uit_NL_EU_Keten_CO2_Dim=\"gCO2eq/MJ\",Keten_NL_Stap3_CO2,\nIF(Uit_NL_EU_Keten_CO2_Dim=\"kgCO2eq/tonds\",Keten_NL_Stap3_CO2*JRC_Basis_Hout_LHVm,\nIF(Uit_NL_EU_Keten_CO2_Dim=\"kgCO2eq\",Keten_NL_Stap3_CO2/1000*Uit_Hout_Doorzet_GJ*1000,\nIF(Uit_NL_EU_Keten_CO2_Dim=\"tonCO2eq\",Keten_NL_Stap3_CO2/1000/1000*Uit_Hout_Doorzet_GJ*1000,\nIF(Uit_NL_EU_Keten_CO2_Dim=\"MtonCO2eq\",Keten_NL_Stap3_CO2/1000/1000/1000*Uit_Hout_Doorzet_GJ*1000)))))","v":0.73684210526315785},{"$f":"IF(Uit_NL_EU_Keten_CO2_Dim=\"gCO2eq/MJ\",Keten_EU_Stap3_CO2,\nIF(Uit_NL_EU_Keten_CO2_Dim=\"kgCO2eq/tonds\",Keten_EU_Stap3_CO2*JRC_Basis_Hout_LHVm,\nIF(Uit_NL_EU_Keten_CO2_Dim=\"kgCO2eq\",Keten_EU_Stap3_CO2/1000*Uit_Hout_Doorzet_GJ*1000,\nIF(Uit_NL_EU_Keten_CO2_Dim=\"tonCO2eq\",Keten_EU_Stap3_CO2/1000/1000*Uit_Hout_Doorzet_GJ*1000,\nIF(Uit_NL_EU_Keten_CO2_Dim=\"MtonCO2eq\",Keten_EU_Stap3_CO2/1000/1000/1000*Uit_Hout_Doorzet_GJ*1000)))))","v":0.37845698999999994},"gCO2eq/MJ","Uit_NL_Keten_Stap3_CO2",null,null,"Uit_EU_Keten_Stap3_CO2"]
[null,"CO2 productie stap 4",null,{"$f":"IF(Uit_NL_EU_Keten_CO2_Dim=\"gCO2eq/MJ\",Keten_NL_Stap4_CO2,\nIF(Uit_NL_EU_Keten_CO2_Dim=\"kgCO2eq/tonds\",Keten_NL_Stap4_CO2*JRC_Basis_Hout_LHVm,\nIF(Uit_NL_EU_Keten_CO2_Dim=\"kgCO2eq\",Keten_NL_Stap4_CO2/1000*Uit_Hout_Doorzet_GJ*1000,\nIF(Uit_NL_EU_Keten_CO2_Dim=\"tonCO2eq\",Keten_NL_Stap4_CO2/1000/1000*Uit_Hout_Doorzet_GJ*1000,\nIF(Uit_NL_EU_Keten_CO2_Dim=\"MtonCO2eq\",Keten_NL_Stap4_CO2/1000/1000/1000*Uit_Hout_Doorzet_GJ*1000)))))","v":0.88947368421052619},{"$f":"IF(Uit_NL_EU_Keten_CO2_Dim=\"gCO2eq/MJ\",Keten_EU_Stap4_CO2,\nIF(Uit_NL_EU_Keten_CO2_Dim=\"kgCO2eq/tonds\",Keten_EU_Stap4_CO2*JRC_Basis_Hout_LHVm,\nIF(Uit_NL_EU_Keten_CO2_Dim=\"kgCO2eq\",Keten_EU_Stap4_CO2/1000*Uit_Hout_Doorzet_GJ*1000,\nIF(Uit_NL_EU_Keten_CO2_Dim=\"tonCO2eq\",Keten_EU_Stap4_CO2/1000/1000*Uit_Hout_Doorzet_GJ*1000,\nIF(Uit_NL_EU_Keten_CO2_Dim=\"MtonCO2eq\",Keten_EU_Stap4_CO2/1000/1000/1000*Uit_Hout_Doorzet_GJ*1000)))))","v":3},"gCO2eq/MJ","Uit_NL_Keten_Stap4_CO2",null,null,"Uit_EU_Keten_Stap4_CO2"]
[null,"CO2 productie stap 5",null,{"$f":"IF(Uit_NL_EU_Keten_CO2_Dim=\"gCO2eq/MJ\",Keten_NL_Stap5_CO2,\nIF(Uit_NL_EU_Keten_CO2_Dim=\"kgCO2eq/tonds\",Keten_NL_Stap5_CO2*JRC_Basis_Hout_LHVm,\nIF(Uit_NL_EU_Keten_CO2_Dim=\"kgCO2eq\",Keten_NL_Stap5_CO2/1000*Uit_Hout_Doorzet_GJ*1000,\nIF(Uit_NL_EU_Keten_CO2_Dim=\"tonCO2eq\",Keten_NL_Stap5_CO2/1000/1000*Uit_Hout_Doorzet_GJ*1000,\nIF(Uit_NL_EU_Keten_CO2_Dim=\"MtonCO2eq\",Keten_NL_Stap5_CO2/1000/1000/1000*Uit_Hout_Doorzet_GJ*1000)))))","v":0},{"$f":"IF(Uit_NL_EU_Keten_CO2_Dim=\"gCO2eq/MJ\",Keten_EU_Stap5_CO2,\nIF(Uit_NL_EU_Keten_CO2_Dim=\"kgCO2eq/tonds\",Keten_EU_Stap5_CO2*JRC_Basis_Hout_LHVm,\nIF(Uit_NL_EU_Keten_CO2_Dim=\"kgCO2eq\",Keten_EU_Stap5_CO2/1000*Uit_Hout_Doorzet_GJ*1000,\nIF(Uit_NL_EU_Keten_CO2_Dim=\"tonCO2eq\",Keten_EU_Stap5_CO2/1000/1000*Uit_Hout_Doorzet_GJ*1000,\nIF(Uit_NL_EU_Keten_CO2_Dim=\"MtonCO2eq\",Keten_EU_Stap5_CO2/1000/1000/1000*Uit_Hout_Doorzet_GJ*1000)))))","v":0},"gCO2eq/MJ","Uit_NL_Keten_Stap5_CO2",null,null,"Uit_EU_Keten_Stap5_CO2"]
[null,"CO2 productie stap 6",null,{"$f":"IF(Uit_NL_EU_Keten_CO2_Dim=\"gCO2eq/MJ\",Keten_NL_Stap6_CO2,\nIF(Uit_NL_EU_Keten_CO2_Dim=\"kgCO2eq/tonds\",Keten_NL_Stap6_CO2*JRC_Basis_Hout_LHVm,\nIF(Uit_NL_EU_Keten_CO2_Dim=\"kgCO2eq\",Keten_NL_Stap6_CO2/1000*Uit_Hout_Doorzet_GJ*1000,\nIF(Uit_NL_EU_Keten_CO2_Dim=\"tonCO2eq\",Keten_NL_Stap6_CO2/1000/1000*Uit_Hout_Doorzet_GJ*1000,\nIF(Uit_NL_EU_Keten_CO2_Dim=\"MtonCO2eq\",Keten_NL_Stap6_CO2/1000/1000/1000*Uit_Hout_Doorzet_GJ*1000)))))","v":0},{"$f":"IF(Uit_NL_EU_Keten_CO2_Dim=\"gCO2eq/MJ\",Keten_EU_Stap6_CO2,\nIF(Uit_NL_EU_Keten_CO2_Dim=\"kgCO2eq/tonds\",Keten_EU_Stap6_CO2*JRC_Basis_Hout_LHVm,\nIF(Uit_NL_EU_Keten_CO2_Dim=\"kgCO2eq\",Keten_EU_Stap6_CO2/1000*Uit_Hout_Doorzet_GJ*1000,\nIF(Uit_NL_EU_Keten_CO2_Dim=\"tonCO2eq\",Keten_EU_Stap6_CO2/1000/1000*Uit_Hout_Doorzet_GJ*1000,\nIF(Uit_NL_EU_Keten_CO2_Dim=\"MtonCO2eq\",Keten_EU_Stap6_CO2/1000/1000/1000*Uit_Hout_Doorzet_GJ*1000)))))","v":0},"gCO2eq/MJ","Uit_NL_Keten_Stap6_CO2",null,null,"Uit_EU_Keten_Stap6_CO2"]
[null,"CO2 productie stap 7",null,{"$f":"IF(Uit_NL_EU_Keten_CO2_Dim=\"gCO2eq/MJ\",Keten_NL_Stap7_CO2,\nIF(Uit_NL_EU_Keten_CO2_Dim=\"kgCO2eq/tonds\",Keten_NL_Stap7_CO2*JRC_Basis_Hout_LHVm,\nIF(Uit_NL_EU_Keten_CO2_Dim=\"kgCO2eq\",Keten_NL_Stap7_CO2/1000*Uit_Hout_Doorzet_GJ*1000,\nIF(Uit_NL_EU_Keten_CO2_Dim=\"tonCO2eq\",Keten_NL_Stap7_CO2/1000/1000*Uit_Hout_Doorzet_GJ*1000,\nIF(Uit_NL_EU_Keten_CO2_Dim=\"MtonCO2eq\",Keten_NL_Stap7_CO2/1000/1000/1000*Uit_Hout_Doorzet_GJ*1000)))))","v":0},{"$f":"IF(Uit_NL_EU_Keten_CO2_Dim=\"gCO2eq/MJ\",Keten_EU_Stap7_CO2,\nIF(Uit_NL_EU_Keten_CO2_Dim=\"kgCO2eq/tonds\",Keten_EU_Stap7_CO2*JRC_Basis_Hout_LHVm,\nIF(Uit_NL_EU_Keten_CO2_Dim=\"kgCO2eq\",Keten_EU_Stap7_CO2/1000*Uit_Hout_Doorzet_GJ*1000,\nIF(Uit_NL_EU_Keten_CO2_Dim=\"tonCO2eq\",Keten_EU_Stap7_CO2/1000/1000*Uit_Hout_Doorzet_GJ*1000,\nIF(Uit_NL_EU_Keten_CO2_Dim=\"MtonCO2eq\",Keten_EU_Stap7_CO2/1000/1000/1000*Uit_Hout_Doorzet_GJ*1000)))))","v":0},"gCO2eq/MJ","Uit_NL_Keten_Stap7_CO2",null,null,"Uit_EU_Keten_Stap7_CO2"]
[]
[]
[]
[]
[null,"PROCES",{"$f":"ROW()","v":197}]
[]
[null,"Houteigenschappen Proces",{"$f":"ROW()","v":199},null,null,null,null,null,null,null,null,null,null,null,{"$f":"B199","v":"Houteigenschappen Proces"}]
[]
[null,"Omschrijving",null,"Waarde","Dimensie","Naam",null,null,null,"Hout","Proces"]
[null,null,null,null,null,null,null,null,null,"Hout","Proces","Transport"]
[null,"Houtsoort",null,{"$f":"Hout_Soort","v":"Loofhout mix NL"},"-","Hout_Soort",null,null,"Soort",{"$f":"D91","v":"Loofhout mix NL"},null,null,null,"Delta"]
[null,"Vochtigheid",null,{"$f":"Hout_Vochtigheid","v":50},"%","Hout_Vochtigheid",null,null,{"$f":"B204","v":"Vochtigheid"},{"$f":"Hout_Vochtigheid","v":50},null,{"$f":"Proces_Vochtigheid","v":50},"%"]
[null,"Δ vochtigheid ",null,{"$f":"Proces_Delta_Vochtigheid","v":0},"%","Proces_Delta_Vochtigheid",null,null,{"$f":"B205","v":"Δ vochtigheid "},null,{"$f":"Proces_Delta_Vochtigheid","v":0},{"$f":"Transport_Delta_Vochtigheid","v":0},"%"]
[null,"Vochtigheid",null,{"$f":"Hout_Vochtigheid+Proces_Delta_Vochtigheid","v":50},"%","Proces_Vochtigheid",null,null,{"$f":"B206","v":"Vochtigheid"},{"$f":"J204","v":50},{"$f":"Proces_Vochtigheid","v":50},{"$f":"Transport_Vochtigheid","v":50},"%",{"$f":"K206-J206","v":0}]
[null,null,null,null,null,null,null,null,null,"Hout","Proces"]
[null,"RHO-0",null,{"$f":"Hout_RHO_0","v":633},"kg/m3","Proces_RHO_0",null,null,{"$f":"B208","v":"RHO-0"},{"$f":"Hout_RHO_0","v":633},{"$f":"Proces_RHO_0","v":633},{"$f":"Transport_RHO_0","v":633},"kg/m3",{"$f":"K208-J208","v":0}]
[null,"Krimp",null,{"$f":"Hout_Krimp","v":15.4},"%","Proces_Krimp",null,null,{"$f":"B209","v":"Krimp"},{"$f":"Hout_Krimp","v":15.4},{"$f":"Proces_Krimp","v":15.4},{"$f":"Transport_Krimp","v":15.4},"%",0]
[null,"Vezel verzadigingspunt",null,{"$f":"Hout_Krimp_Hs","v":23},"%","Proces_Krimp_Hs",null,null,"Vezel verzadigingspunt",{"$f":"Hout_Krimp_Hs","v":23},{"$f":"Proces_Krimp_Hs","v":23},{"$f":"Transport_Krimp_Hs","v":23},"%",0]
[null,"RHO Volume Factor=1",null,{"$f":"IF(Proces_Vochtigheid>Proces_Krimp_Hs,Proces_RHO_0*(1-Proces_Krimp/100)/(1-Proces_Vochtigheid/100),Proces_RHO_0*(1-Proces_Vochtigheid/Proces_Krimp_Hs*Proces_Krimp/100)/(1-Proces_Vochtigheid/100))","v":1071.0360000000001},"m3","Proces_RHO_VF1",null,null,"RHO Volume Factor=1",{"$f":"Hout_RHO_VF1","v":1071.0360000000001},{"$f":"Proces_RHO_VF1","v":1071.0360000000001},{"$f":"Transport_RHO_VF1","v":1071.0360000000001},"m3",0]
[null,"Massa hout",null,{"$f":"Proces_RHO_VF1*(1-Proces_Vochtigheid/100)","v":535.51800000000003},"kg","Proces_Massa",null,null,"Massa hout",{"$f":"Hout_Massa","v":535.51800000000003},{"$f":"Proces_Massa","v":535.51800000000003},{"$f":"Transport_Massa","v":535.51800000000003},"kg",0]
[null,"Massa water",null,{"$f":"Proces_RHO_VF1*Proces_Vochtigheid/100","v":535.51800000000003},"kg","Proces_Water",null,null,"Massa water",{"$f":"Hout_Water","v":535.51800000000003},{"$f":"Proces_Water","v":535.51800000000003},{"$f":"Transport_Water","v":535.51800000000003},"kg",0]
[null,"Totale massa",null,{"$f":"Proces_Massa+Proces_Water","v":1071.0360000000001},"kg","Proces_Massa_Water",null,null,"Totale massa",{"$f":"Hout_Massa_Water","v":1071.0360000000001},{"$f":"Proces_Massa_Water","v":1071.0360000000001},{"$f":"Transport_Massa_Water","v":1071.0360000000001},"kg",0]
[null,null,null,null,null,null,null,null,null,null,null,null,null,0]
[null,"Volume soort",null,{"$f":"Proces_Vorm","v":"Chips G50/P31,5"},null,"Proces_Vorm",null,null,null,{"$f":"D103","v":"Top- en takhout"},{"$f":"D216","v":"Chips G50/P31,5"}]
[null,"Volume Type Factor",null,{"$f":"LOOKUP(Proces_Vorm,Lijst_Volume_Vorm,Lijst_Volume_Vorm_Factor)","v":0.33},null,"Proces_Vorm_Vulling",null,null,{"$f":"B217","v":"Volume Type Factor"},{"$f":"Hout_Vorm_Vulling","v":0.3},{"$f":"Proces_Vorm_Vulling","v":0.33},null,"m3/m3",3.0000000000000027E-2]
[null,"RHO bij Volume Factor",null,{"$f":"Proces_RHO_VF1*Proces_Vorm_Vulling","v":353.44188000000003},null,"Proces_RHO",null,null,{"$f":"B218","v":"RHO bij Volume Factor"},{"$f":"Hout_RHO","v":321.31080000000003},{"$f":"Proces_RHO","v":353.44188000000003},null,"kg/m3",32.131079999999997]
[null,null,null,null,null,null,null,null,null,null,null,null,null,0]
[null,"HHV-ds",null,{"$f":"Hout_HHVds","v":19.3},"GJ/ton","Proces_HHVds",null,null,"HHV-ds",{"$f":"Hout_HHVds","v":19.3},{"$f":"Proces_HHVds","v":19.3},null,"GJ/ton",0]
[null,"H2",null,{"$f":"Hout_H2","v":6},"%","Proces_H2",null,null,"H2",{"$f":"Hout_H2","v":6},{"$f":"Proces_H2","v":6},null,"%",0]
[null,"Berekening LHVds",null,{"$f":"LHV_Vochtigheid","v":1},"-","LHV_Vochtigheid"]
[null,"Berekening LHVds",null,{"$f":"LHV_Vochtigheid_Verdampingswarmte","v":0},null,"LHV_Vochtigheid_Verdampingswarmte"]
[null,"Berekening LHVds",null,{"$f":"LHV_Vochtigheid_Verdampingswarmte_H2","v":0},null,"LHV_Vochtigheid_Verdampingswarmte_H2"]
[null,"LHV-ds",null,{"$f":"Proces_HHVds","v":19.3},"GJ/tonds","Proces_LHVds",null,null,"LHV-ds",{"$f":"Hout_LHVds","v":19.3},{"$f":"Proces_LHVds","v":19.3},null,"GJ/tonds"]
[null,"LHV-Hm",null,{"$f":"LHV_Vochtigheid*Proces_HHVds*(1-Proces_Vochtigheid/100)\n-LHV_Vochtigheid_Verdampingswarmte*2.447*Proces_Vochtigheid/100\n-LHV_Vochtigheid_Verdampingswarmte_H2*Proces_H2/(100*2)*18.02*2.447*(1-Proces_Vochtigheid/100)","v":9.65},"GJ/ton","Proces_LHVm",null,null,"LHV-Hm",{"$f":"Hout_LHVm","v":9.65},{"$f":"Proces_LHVm","v":9.65},null,"GJ/ton",{"$f":"K226-J226","v":0}]
[null,"LHV-Hv",null,{"$f":"Proces_LHVm*Proces_RHO/1000","v":3.4107141420000002},"GJ/m3","Proces_LHVv",null,null,"LHV-Hv",{"$f":"Hout_LHVv","v":3.1006492200000002},{"$f":"Proces_LHVv","v":3.4107141420000002},null,"GJ/m3",{"$f":"K227-J227","v":0.31006492200000002}]
[null,null,null,null,null,null,null,null,null,null,null,null,null,{"$f":"K228-J228","v":0}]
[null,null,null,{"$f":"IF(Proces_LHVv_Dim=\"GJ/m3\",Proces_LHVv,Proces_LHVv/3.6)","v":3.4107141420000002},{"$f":"Proces_LHVv_Dim","v":"GJ/m3"},"Uit_Hout_LHVv",null,null,null,{"$f":"Uit_Hout_LHVv","v":0.86129145000000007},{"$f":"Uit_Proces_LHVv","v":3.4107141420000002},null,{"$f":"Proces_LHVv_Dim","v":"GJ/m3"},{"$f":"K229-J229","v":2.5494226920000003}]
[null,null,null,{"$f":"IF(Hout_LHVm_Dim=\"GJ/ton\",Hout_LHVm,\nIF(Hout_LHVm_Dim=\"MWh/ton\",Hout_LHVm/3.6,\nIF(Hout_LHVm_Dim=\"GJ/tonds\",Hout_LHVds,\nIF(Hout_LHVm_Dim=\"MWh/tonds\",Hout_LHVds/3.6,\"berekening LHVm\"))))","v":9.65},{"$f":"Proces_LHVm_Dim","v":"GJ/ton"},"Uit_Hout_LHVm",null,null,null,{"$f":"Uit_Hout_LHVm","v":9.65},{"$f":"Uit_Proces_LHVm","v":9.65},null,{"$f":"Proces_LHVm_Dim","v":"GJ/ton"},{"$f":"K230-J230","v":0}]
[]
[]
[null,"Proces - Doorzet",{"$f":"ROW()","v":233},null,null,null,null,null,null,"Hout","Proces",null,null,null,{"$f":"B233","v":"Proces - Doorzet"}]
[]
[]
[null,"Doorzet Hout",null,{"$f":"Hout_Doorzet_Oogst_Eindgebruiker","v":10000},null,"Hout_Doorzet",null,null,"Doorzet Hout",{"$f":"D123","v":10000}]
[null,"Doorzet Hout Dim",null,{"$f":"Hout_Doorzet_Dim","v":"m3"},null,"Hout_Doorzet_Dim",null,null,"Doorzet Hout Dim"]
[null,"Houtverlies",null,{"$f":"Proces_Houtverlies","v":-2},"%","Proces_Houtverlies",null,null,"Houtverlies",null,{"$f":"D238","v":-2}]
[null,"Houtverlies Modus",null,{"$f":"Proces_Houtverlies_Modus","v":"%"},null,"Proces_Houtverlies_Modus",null,null,"Houtverlies Modus"]
[null,"Houtverlies Modus Dim",null,"tonds",null,null,null,null,"Houtverlies Modus Dim"]
[null,"Doorzet Proces",null,{"$f":"IF(Hout_Oogst_Eindgebruiker=\"naar eindgebruiker\",Uit_Transport_Doorzet_tonds/((100+Transport_Houtverlies)/100),Uit_Hout_Doorzet_tonds*(100+Proces_Houtverlies)/100)","v":1767.2094},null,"Uit_Proces_Doorzet",null,null,"Doorzet Proces",{"$f":"D123","v":10000},{"$f":"Uit_Proces_Doorzet","v":1767.2094}]
[null,null,null,null,null,null,null,null,null,"Hout","Proces",null,null,null,"Controle"]
[null,"Doorzet",null,{"$f":"Uit_Proces_Doorzet_GJ/Proces_LHVv","v":10000},"m3","Uit_Proces_Doorzet_m3",null,null,"m3",{"$f":"Uit_Hout_Doorzet_m3","v":11224.489795918365},{"$f":"Uit_Proces_Doorzet_m3","v":10000},"m3",{"$f":"K243-J243","v":-1224.4897959183654},null,{"$f":"Uit_Hout_Doorzet_m3*Hout_LHVv","v":34803.205530612242},{"$f":"Uit_Proces_Doorzet_m3*Proces_LHVv","v":34107.14142},"GJ"]
[null,"Doorzet",null,{"$f":"Uit_Proces_Doorzet_GJ/Proces_LHVm*1000","v":3534418.8},"kg","Uit_Proces_Doorzet_kg",null,null,"kg",{"$f":"Uit_Hout_Doorzet_kg","v":3606549.7959183669},{"$f":"Uit_Proces_Doorzet_kg","v":3534418.8},"kg",{"$f":"K244-J244","v":-72130.995918367058},null,{"$f":"Uit_Hout_Doorzet_kg*Hout_LHVm/1000","v":34803.205530612242},{"$f":"Uit_Proces_Doorzet_kg*Proces_LHVm/1000","v":34107.14142},"GJ"]
[null,"Doorzet",null,{"$f":"Uit_Proces_Doorzet_kg*(1-Proces_Vochtigheid/100)","v":1767209.4},"kgds","Uit_Proces_Doorzet_kgds",null,null,"kgds",{"$f":"Uit_Hout_Doorzet_kgds","v":1803274.8979591834},{"$f":"Uit_Proces_Doorzet_kgds","v":1767209.4},"kgds",-36065.497959183529,null,{"$f":"Uit_Hout_Doorzet_kgds/(1-Hout_Vochtigheid/100)*Hout_LHVm/1000","v":34803.205530612242},{"$f":"Uit_Proces_Doorzet_kgds/(1-Proces_Vochtigheid/100)*Proces_LHVm/1000","v":34107.14142},"GJ"]
[null,"Doorzet",null,{"$f":"Uit_Proces_Doorzet_GJ/Proces_LHVm","v":3534.4187999999999},"ton","Uit_Proces_Doorzet_ton",null,null,"ton",{"$f":"Uit_Hout_Doorzet_ton","v":3606.5497959183667},{"$f":"Uit_Proces_Doorzet_ton","v":3534.4187999999999},"ton",-72.130995918366807,null,{"$f":"Uit_Hout_Doorzet_ton*Hout_LHVm","v":34803.205530612242},{"$f":"Uit_Proces_Doorzet_ton*Proces_LHVm","v":34107.14142},"GJ"]
[null,"Doorzet",null,{"$f":"Uit_Proces_Doorzet_GJ/Proces_LHVds","v":1767.2094},"tonds","Uit_Proces_Doorzet_tonds",null,null,"tonds",{"$f":"Uit_Hout_Doorzet_tonds","v":1803.2748979591834},{"$f":"Uit_Proces_Doorzet_tonds","v":1767.2094},"tonds",-36.065497959183404,null,{"$f":"Uit_Hout_Doorzet_tonds*Hout_LHVds","v":34803.205530612242},{"$f":"Uit_Proces_Doorzet_tonds*Proces_LHVds","v":34107.14142},"GJ"]
[null,"Doorzet",null,{"$f":"Uit_Proces_Doorzet_GJ*1000","v":34107141.420000002},"MJ","Uit_Proces_Doorzet_MJ",null,null,"MJ",{"$f":"Uit_Hout_Doorzet_MJ","v":34803205.530612245},{"$f":"Uit_Proces_Doorzet_MJ","v":34107141.420000002},"MJ",-696064.11061224341,null,{"$f":"Uit_Hout_Doorzet_MJ/1000","v":34803.205530612242},{"$f":"Uit_Proces_Doorzet_MJ/1000","v":34107.14142},"GJ"]
[null,"Doorzet",null,{"$f":"IF(D240=\"m3\",Uit_Proces_Doorzet*Proces_LHVv,\nIF(D240=\"kg\",Uit_Proces_Doorzet*Proces_LHVm/1000,\nIF(D240=\"kgds\",Uit_Proces_Doorzet*Proces_LHVds/1000,\nIF(D240=\"ton\",Uit_Proces_Doorzet*Proces_LHVm,\nIF(D240=\"tonds\",Uit_Proces_Doorzet*Proces_LHVds,\nIF(D240=\"GJ\",Uit_Proces_Doorzet,\nIF(D240=\"MJ\",Uit_Proces_Doorzet/1000,\nIF(D240=\"MWh\",Uit_Proces_Doorzet*3.6,\nIF(D240=\"kWh\",Uit_Proces_Doorzet*3.6/1000,\"Proces-Doorzet-GJ\")))))))))","v":34107.14142},"GJ","Uit_Proces_Doorzet_GJ",null,null,"GJ",{"$f":"Uit_Hout_Doorzet_GJ","v":34803.205530612242},{"$f":"Uit_Proces_Doorzet_GJ","v":34107.14142},"GJ",-696.06411061224208,null,{"$f":"Uit_Hout_Doorzet_GJ","v":34803.205530612242},{"$f":"Uit_Proces_Doorzet_GJ","v":34107.14142},"GJ"]
[null,"Doorzet",null,{"$f":"Uit_Proces_Doorzet_GJ/3.6*1000","v":9474205.9499999993},"kWh","Uit_Proces_Doorzet_kWh",null,null,"kWh",{"$f":"Uit_Hout_Doorzet_kWh","v":9667557.0918367337},{"$f":"Uit_Proces_Doorzet_kWh","v":9474205.9499999993},"kWh",-193351.14183673449,null,{"$f":"Uit_Hout_Doorzet_kWh*3.6/1000","v":34803.205530612242},{"$f":"Uit_Proces_Doorzet_kWh*3.6/1000","v":34107.14142},"GJ"]
[null,"Doorzet",null,{"$f":"Uit_Proces_Doorzet_GJ/3.6","v":9474.2059499999996},"MWh","Uit_Proces_Doorzet_MWh",null,null,"MWh",{"$f":"Uit_Hout_Doorzet_MWh","v":9667.5570918367339},{"$f":"Uit_Proces_Doorzet_MWh","v":9474.2059499999996},"MWh",-193.35114183673431,null,{"$f":"Uit_Hout_Doorzet_MWh*3.6","v":34803.205530612242},{"$f":"Uit_Proces_Doorzet_MWh*3.6","v":34107.14142},"GJ"]
[null,null,"De doorzet wordt in eerste instantie berekend voor GJ"]
[null,null,"Daaruit worden de andere dimensies berekend"]
[]
[]
[]
[null,"Proces Aandrijving tijd",{"$f":"ROW()","v":257},null,null,null,null,null,null,null,null,null,null,null,{"$f":"B257","v":"Proces Aandrijving tijd"}]
[]
[null,"Inzet verbrandingsmotor",null,{"$f":"Proces_Verbrandingsmotor_Inzet","v":50},null,"Proces_Verbrandingsmotor_Inzet"]
[null,"Inzet verbrandingsmotor",null,{"$f":"Proces_Verbrandingsmotor_Inzet_Dim","v":"m3/uur"},null,"Proces_Verbrandingsmotor_Inzet_Dim"]
[null,"Maschinetijd Verbrandingsmotor",null,{"$f":"IF(Proces_Verbrandingsmotor_Ja_Nee=\"Nee\",0,\nIF(Proces_Verbrandingsmotor_Inzet_Dim=\"GJ/uur\",IF(Proces_Verbrandingsmotor_Inzet=0,0,Uit_Hout_Doorzet_GJ/Proces_Verbrandingsmotor_Inzet),\nIF(Proces_Verbrandingsmotor_Inzet_Dim=\"uur/GJ\",Proces_Verbrandingsmotor_Inzet*Uit_Hout_Doorzet_GJ,\nIF(Proces_Verbrandingsmotor_Inzet_Dim=\"MWh/uur\",IF(Proces_Verbrandingsmotor_Inzet=0,0,Uit_Hout_Doorzet_MWh/Proces_Verbrandingsmotor_Inzet),\nIF(Proces_Verbrandingsmotor_Inzet_Dim=\"uur/MWh\",Proces_Verbrandingsmotor_Inzet*Uit_Hout_Doorzet_MWh,\nIF(Proces_Verbrandingsmotor_Inzet_Dim=\"m3/uur\",IF(Proces_Verbrandingsmotor_Inzet=0,0,Uit_Hout_Doorzet_m3/Proces_Verbrandingsmotor_Inzet),\nIF(Proces_Verbrandingsmotor_Inzet_Dim=\"uur/m3\",Proces_Verbrandingsmotor_Inzet*Uit_Hout_Doorzet_m3,\nIF(Proces_Verbrandingsmotor_Inzet_Dim=\"ton/uur\",IF(Proces_Verbrandingsmotor_Inzet=0,0,Uit_Hout_Doorzet_ton/Proces_Verbrandingsmotor_Inzet),\nIF(Proces_Verbrandingsmotor_Inzet_Dim=\"uur/ton\",Proces_Verbrandingsmotor_Inzet*Uit_Hout_Doorzet_ton,\nIF(Proces_Verbrandingsmotor_Inzet_Dim=\"tonds/uur\",IF(Proces_Verbrandingsmotor_Inzet=0,0,Uit_Hout_Doorzet_tonds/Proces_Verbrandingsmotor_Inzet),\nIF(Proces_Verbrandingsmotor_Inzet_Dim=\"uur/tonds\",Proces_Verbrandingsmotor_Inzet*Uit_Hout_Doorzet_tonds,\nIF(Proces_Verbrandingsmotor_Inzet_Dim=\"uur\",IF(Proces_Verbrandingsmotor_Inzet=0,0,Proces_Verbrandingsmotor_Inzet)))))))))))))","v":224.48979591836732},"uur","Uit_Proces_Verbrandingsmotor_Tijd_uur",null,null,null,null,"RHO",{"$f":"Proces_RHO","v":353.44188000000003},"kg/m3",null,"uur"]
[null,"Capaciteit verbrandingsmotor",null,{"$f":"IF(Uit_Proces_Verbrandingsmotor_Tijd_uur=0,0,Uit_Hout_Doorzet_m3/Uit_Proces_Verbrandingsmotor_Tijd_uur)","v":50},"m3/uur","Uit_Proces_Verbrandingsmotor_Tijd_m3_uur",null,null,null,null,"LHVv",{"$f":"Proces_LHVv","v":3.4107141420000002},{"$f":"Proces_LHVv_Dim","v":"GJ/m3"},null,"m3/uur"]
[null,"Capaciteit verbrandingsmotor",null,{"$f":"IF(Uit_Proces_Verbrandingsmotor_Tijd_uur=0,0,Uit_Hout_Doorzet_ton/Uit_Proces_Verbrandingsmotor_Tijd_uur)","v":16.065539999999999},"ton/uur","Uit_Proces_Verbrandingsmotor_Tijd_ton_uur",null,null,null,null,"LHVm",{"$f":"Proces_LHVm","v":9.65},{"$f":"Proces_LHVm_Dim","v":"GJ/ton"},null,"ton/uur"]
[null,"Capaciteit verbrandingsmotor",null,{"$f":"IF(Uit_Proces_Verbrandingsmotor_Tijd_uur=0,0,Uit_Hout_Doorzet_tonds/Uit_Proces_Verbrandingsmotor_Tijd_uur)","v":8.0327699999999993},"tonds/uur","Uit_Proces_Verbrandingsmotor_Tijd_tonds_uur",null,null,null,null,null,null,null,null,"tonds/uur"]
[null,"Capaciteit verbrandingsmotor",null,{"$f":"IF(Uit_Proces_Verbrandingsmotor_Tijd_uur=0,0,Uit_Hout_Doorzet_GJ/Uit_Proces_Verbrandingsmotor_Tijd_uur)","v":155.03246100000001},"GJ/uur","Uit_Proces_Verbrandingsmotor_Tijd_GJ_uur",null,null,null,null,null,null,null,null,"GJ/uur"]
[null,"Capaciteit verbrandingsmotor",null,{"$f":"IF(Uit_Proces_Verbrandingsmotor_Tijd_uur=0,0,Uit_Hout_Doorzet_MWh/Uit_Proces_Verbrandingsmotor_Tijd_uur)","v":43.064572500000004},"MWh/uur","Uit_Proces_Verbrandingsmotor_Tijd_MWh_uur",null,null,null,null,null,null,null,null,"MWh/uur"]
[null,"Capaciteit verbrandingsmotor",null,{"$f":"IF(Uit_Proces_Verbrandingsmotor_Tijd_m3_uur=0,0,1/Uit_Proces_Verbrandingsmotor_Tijd_m3_uur)","v":0.02},"uur/m3","Uit_Proces_Verbrandingsmotor_Tijd_uur_m3",null,null,null,null,"Doorzet",{"$f":"Uit_Hout_Doorzet_m3","v":11224.489795918365},"m3",null,"uur/m3"]
[null,"Capaciteit verbrandingsmotor",null,{"$f":"IF(Uit_Proces_Verbrandingsmotor_Tijd_ton_uur=0,0,1/Uit_Proces_Verbrandingsmotor_Tijd_ton_uur)","v":6.2245028800774829E-2},"uur/ton","Uit_Proces_Verbrandingsmotor_Tijd_uur_ton",null,null,null,null,"Doorzet",{"$f":"Uit_Hout_Doorzet_ton","v":3606.5497959183667},"ton",null,"uur/ton"]
[null,"Capaciteit verbrandingsmotor",null,{"$f":"IF(Uit_Proces_Verbrandingsmotor_Tijd_tonds_uur=0,0,1/Uit_Proces_Verbrandingsmotor_Tijd_tonds_uur)","v":0.12449005760154966},"uur/tonds","Uit_Proces_Verbrandingsmotor_Tijd_uur_tonds",null,null,null,null,"Doorzet",{"$f":"Uit_Hout_Doorzet_tonds","v":1803.2748979591834},"tonds",null,"uur/tonds"]
[null,"Capaciteit verbrandingsmotor",null,{"$f":"IF(Uit_Proces_Verbrandingsmotor_Tijd_GJ_uur=0,0,1/Uit_Proces_Verbrandingsmotor_Tijd_GJ_uur)","v":6.4502620518937636E-3},"uur/GJ","Uit_Proces_Verbrandingsmotor_Tijd_uur_GJ",null,null,null,null,"Doorzet",{"$f":"Uit_Hout_Doorzet_GJ","v":34803.205530612242},"GJ",null,"uur/GJ"]
[null,"Capaciteit verbrandingsmotor",null,{"$f":"IF(Uit_Proces_Verbrandingsmotor_Tijd_MWh_uur=0,0,1/Uit_Proces_Verbrandingsmotor_Tijd_MWh_uur)","v":2.3220943386817551E-2},"uur/MWh","Uit_Proces_Verbrandingsmotor_Tijd_uur_MWh",null,null,null,null,"Doorzet",{"$f":"Uit_Hout_Doorzet_MWh","v":9667.5570918367339},"MWh",null,"uur/MWh"]
[]
[]
[null,"Proces Aandrijving CO2",{"$f":"ROW()","v":274},null,null,null,null,null,null,null,null,null,null,null,{"$f":"B274","v":"Proces Aandrijving CO2"}]
[]
[null,"Verbrandingsmotor"]
[]
[null,"Aandrijving Verbrandingsmotor",null,"Ja","-","Proces_Verbrandingsmotor_Ja_Nee"]
[null,"Verbrandingsmotor-ID",null,{"$f":"IF(Proces_Verbrandingsmotor_Ja_Nee=\"Ja\",1,0)","v":1},"-","Proces_Verbrandingsmotor_ID"]
[null,"Brandstoflijst",null,{"$f":"Algemeen_Berekening_Methodiek_ID","v":"EU"},null,"Algemeen_Berekening_Methodiek_ID"]
[null,"Brandstof",null,{"$f":"Proces_Verbrandingsmotor_Brandstof","v":"EU-Diesel"},null,"Proces_Verbrandingsmotor_Brandstof"]
[null,"Brandstoffen-RHO",null,{"$f":"IF(Algemeen_Berekening_Methodiek_ID=\"EU\",LOOKUP(Proces_Verbrandingsmotor_Brandstof,Lijst_Brandstof_EU_Soort,Lijst_Brandstof_EU_RHO),\nIF(Algemeen_Berekening_Methodiek_ID=\"NL\",LOOKUP(Proces_Verbrandingsmotor_Brandstof,Lijst_Brandstof_NL_Soort,Lijst_Brandstof_NL_RHO),\nLOOKUP(Proces_Verbrandingsmotor_Brandstof,Lijst_Brandstof_NL_EU_Soort,Lijst_Brandstof_NL_EU_RHO)))","v":832},"kg/m3","Uit_Proces_Brandstof_RHO"]
[null,"Brandstoffen-LHVv",null,{"$f":"IF(Proces_Verbrandingsmotor_Ja_Nee=\"Ja\",IF(Proces_Verbrandingsmotor_Brandstof=\"\",0,LOOKUP(Proces_Verbrandingsmotor_Brandstof,Lijst_Fossiel_Soort,Lijst_Fossiel_LHV_GJ_m3)),0)","v":35.512999999999998},"GJ/m3","Uit_Proces_Brandstof_LHVv"]
[null,"Brandstoffen-LHVm",null,{"$f":"IF(Proces_Verbrandingsmotor_Ja_Nee=\"Ja\",IF(Proces_Verbrandingsmotor_Brandstof=\"\",0,LOOKUP(Proces_Verbrandingsmotor_Brandstof,Lijst_Fossiel_Soort,Lijst_Fossiel_LHV_MJ_kg)),0)","v":41.78},"MJ/kg","Uit_Proces_Brandstof_LHVm"]
[null,"Maschinetijd",null,{"$f":"Uit_Proces_Verbrandingsmotor_Tijd_uur","v":224.48979591836732},"uur","Uit_Proces_Verbrandingsmotor_Tijd_uur"]
[null,"Brandstofverbruik",null,{"$f":"IF(Proces_Verbrandingsmotor_Ja_Nee=\"Ja\",Proces_Verbrandingsmotor_Verbruik,0)","v":50},{"$f":"Proces_Verbrandingsmotor_Verbruik_Dim","v":"liter/uur"}]
[null,"Brandstofverbruik",null,{"$f":"IF(Proces_Verbrandingsmotor_Ja_Nee=\"Nee\",0,\nIF(Proces_Verbrandingsmotor_Verbruik_Dim<>\"\",\nIF(Proces_Verbrandingsmotor_Verbruik_Dim=\"liter\",Proces_Verbrandingsmotor_Verbruik,\nIF(Proces_Verbrandingsmotor_Verbruik_Dim=\"m3\",Proces_Verbrandingsmotor_Verbruik*1000,\nIF(Proces_Verbrandingsmotor_Verbruik_Dim=\"kg\",Proces_Verbrandingsmotor_Verbruik/Uit_Proces_Brandstof_RHO*1000,\nIF(Proces_Verbrandingsmotor_Verbruik_Dim=\"ton\",Proces_Verbrandingsmotor_Verbruik/Uit_Proces_Brandstof_RHO*1000*1000,\nIF(Proces_Verbrandingsmotor_Verbruik_Dim=\"liter/uur\",Proces_Verbrandingsmotor_Verbruik*Uit_Proces_Verbrandingsmotor_Tijd_uur,\nIF(Proces_Verbrandingsmotor_Verbruik_Dim=\"m3/uur\",Proces_Verbrandingsmotor_Verbruik*Uit_Proces_Verbrandingsmotor_Tijd_uur*1000,\nIF(Proces_Verbrandingsmotor_Verbruik_Dim=\"kg/uur\",Proces_Verbrandingsmotor_Verbruik/Uit_Proces_Brandstof_RHO*1000*Uit_Proces_Verbrandingsmotor_Tijd_uur,\nIF(Proces_Verbrandingsmotor_Verbruik_Dim=\"ton/uur\",Proces_Verbrandingsmotor_Verbruik/Uit_Proces_Brandstof_RHO*1000*1000*Uit_Proces_Verbrandingsmotor_Tijd_uur))))))))))","v":11224.489795918365},"liter","Uit_Proces_Verbrandingsmotor_Verbruik_liter",null,null,null,"←Brandstofverbruik wordt berekend voor liter",null,null,null,null,"liter"]
[null,"Brandstofverbruik",null,{"$f":"Uit_Proces_Verbrandingsmotor_Verbruik_liter*Uit_Proces_Brandstof_RHO/1000","v":9338.775510204081},"kg","Uit_Proces_Verbrandingsmotor_Verbruik_kg",null,null,null,"Daaruit worden de andere dimensies berekend",null,null,null,null,"m3"]
[null,"Brandstofverbruik",null,{"$f":"Uit_Proces_Verbrandingsmotor_Verbruik_liter/1000","v":11.224489795918366},"m3","Uit_Proces_Verbrandingsmotor_Verbruik_m3",null,null,null,null,null,null,null,null,"kg"]
[null,"Brandstofverbruik",null,{"$f":"Uit_Proces_Verbrandingsmotor_Verbruik_kg/1000","v":9.3387755102040817},"ton","Uit_Proces_Verbrandingsmotor_Verbruik_ton",null,null,null,null,null,null,null,null,"ton"]
[null,"Brandstofverbruik",null,{"$f":"IF(Uit_Proces_Verbrandingsmotor_Tijd_uur=0,0,Uit_Proces_Verbrandingsmotor_Verbruik_liter/Uit_Proces_Verbrandingsmotor_Tijd_uur)","v":50},"liter/uur","Uit_Proces_Verbrandingsmotor_Verbruik_liter_uur",null,null,null,null,null,null,null,null,"liter/uur"]
[null,"Brandstofverbruik",null,{"$f":"IF(Uit_Proces_Verbrandingsmotor_Tijd_uur=0,0,Uit_Proces_Verbrandingsmotor_Verbruik_kg/Uit_Proces_Verbrandingsmotor_Tijd_uur)","v":41.6},"kg/uur","Uit_Proces_Verbrandingsmotor_Verbruik_kg_uur",null,null,null,null,null,null,null,null,"m3/uur"]
[null,"Brandstofverbruik",null,{"$f":"IF(Uit_Proces_Verbrandingsmotor_Tijd_uur=0,0,Uit_Proces_Verbrandingsmotor_Verbruik_m3/Uit_Proces_Verbrandingsmotor_Tijd_uur)","v":0.05},"m3/uur","Uit_Proces_Verbrandingsmotor_Verbruik_m3_uur",null,null,null,null,null,null,null,null,"kg/uur"]
[null,"Brandstofverbruik",null,{"$f":"IF(Uit_Proces_Verbrandingsmotor_Tijd_uur=0,0,Uit_Proces_Verbrandingsmotor_Verbruik_ton/Uit_Proces_Verbrandingsmotor_Tijd_uur)","v":4.1600000000000005E-2},"ton/uur","Uit_Proces_Verbrandingsmotor_Verbruik_ton_uur",null,null,null,null,null,null,null,null,"ton/uur"]
[]
[null,"Brandstofverbruik",null,{"$f":"IF(Proces_Verbrandingsmotor_Ja_Nee=\"Ja\",Uit_Proces_Verbrandingsmotor_Verbruik_kg*Uit_Proces_Brandstof_LHVm,0)","v":390174.04081632651},"MJ","Uit_Proces_Verbrandingsmotor_Verbruik_MJ"]
[null,"Methode",null,{"$f":"Algemeen_Berekening_Methodiek_ID","v":"EU"},"-","Algemeen_Berekening_Methodiek_ID"]
[null,"CO2",null,{"$f":"IF(Proces_Verbrandingsmotor_Ja_Nee=\"Nee\",0,\nIF(Algemeen_Berekening_Methodiek_ID=\"EU\",LOOKUP(Proces_Verbrandingsmotor_Brandstof,Lijst_Brandstof_EU_Soort,Lijst_Brandstof_EU_CO2),\nIF(Algemeen_Berekening_Methodiek_ID=\"NL\",LOOKUP(Proces_Verbrandingsmotor_Brandstof,Lijst_Brandstof_NL_Soort,Lijst_Brandstof_NL_CO2),\nLOOKUP(Proces_Verbrandingsmotor_Brandstof,Lijst_Brandstof_NL_EU_Soort,Lijst_Brandstof_NL_EU_CO2))))","v":93.947222222222209},"g/MJ","Uit_Proces_Verbrandingsmotor_Emissie_CO2"]
[null,"CH4",null,{"$f":"IF(Proces_Verbrandingsmotor_Ja_Nee=\"Nee\",0,\nIF(Algemeen_Berekening_Methodiek_ID=\"EU\",LOOKUP(Proces_Verbrandingsmotor_Brandstof,Lijst_Brandstof_EU_Soort,Lijst_Brandstof_EU_CH4),\nIF(Algemeen_Berekening_Methodiek_ID=\"NL\",LOOKUP(Proces_Verbrandingsmotor_Brandstof,Lijst_Brandstof_NL_Soort,Lijst_Brandstof_NL_CH4),\nLOOKUP(Proces_Verbrandingsmotor_Brandstof,Lijst_Brandstof_NL_EU_Soort,Lijst_Brandstof_NL_EU_CH4))))","v":0},"g/MJ","Uit_Proces_Verbrandingsmotor_Emissie_CH4"]
[null,"N2O",null,{"$f":"IF(Proces_Verbrandingsmotor_Ja_Nee=\"Nee\",0,\nIF(Algemeen_Berekening_Methodiek_ID=\"EU\",LOOKUP(Proces_Verbrandingsmotor_Brandstof,Lijst_Brandstof_EU_Soort,Lijst_Brandstof_EU_N2O),\nIF(Algemeen_Berekening_Methodiek_ID=\"NL\",LOOKUP(Proces_Verbrandingsmotor_Brandstof,Lijst_Brandstof_NL_Soort,Lijst_Brandstof_NL_N2O),\nLOOKUP(Proces_Verbrandingsmotor_Brandstof,Lijst_Brandstof_NL_EU_Soort,Lijst_Brandstof_NL_EU_N2O))))","v":0},"g/MJ","Uit_Proces_Verbrandingsmotor_Emissie_N2O"]
[null,"CO2 - equivalent",null,{"$f":"Uit_Proces_Verbrandingsmotor_Emissie_CO2*JRC_GWP_CO2\n+Uit_Proces_Verbrandingsmotor_Emissie_CH4*JRC_GWP_CH4\n+Uit_Proces_Verbrandingsmotor_Emissie_N2O*JRC_GWP_N2O","v":93.947222222222209},"g/MJ","Uit_Proces_Verbrandingsmotor_Emissie_CO2eq"]
[]
[null,"Doorzet invoer",null,{"$f":"Uit_Hout_Doorzet_GJ","v":34803.205530612242},"GJ","Uit_Hout_Doorzet_GJ"]
[null,"Doorzet uitvoer",null,{"$f":"Uit_Proces_Doorzet_GJ","v":34107.14142},"GJ","Uit_Proces_Doorzet_GJ"]
[null,"Doorzet invoer",null,{"$f":"Uit_Hout_Doorzet_tonds","v":1803.2748979591834},"tonds","Uit_Hout_Doorzet_tonds"]
[null,"Doorzet uitvoer",null,{"$f":"Uit_Proces_Doorzet_tonds","v":1767.2094},"tonds","Uit_Proces_Doorzet_tonds"]
[null,"Invoer / uitvoer?",null,{"$f":"Uit_Proces_Invoer_Uitvoer_Dim","v":"Uitvoer"},null,"Uit_Proces_Invoer_Uitvoer_Dim"]
[null,"CO2/Doorzet-MJ",null,{"$f":"IF(Proces_Verbrandingsmotor_Ja_Nee=\"Nee\",0,\nIF(Uit_Proces_Invoer_Uitvoer_Dim=\"Invoer\",\nIF(Uit_Hout_Doorzet_MJ=0,0,Uit_Proces_Verbrandingsmotor_CO2T_g/Uit_Hout_Doorzet_MJ),\nIF(Uit_Proces_Doorzet_MJ=0,0,Uit_Proces_Verbrandingsmotor_CO2T_g/Uit_Proces_Doorzet_MJ)))","v":1.0747241132444871},"gCO2eq/MJ",null,"Uit_Proces_Verbrandingsmotor_CO2T_g_MJ",null,null,null,null,null,null,"gCO2eq/MJ"]
[null,"CO2/Doorzet-tonds",null,{"$f":"IF(Proces_Verbrandingsmotor_Ja_Nee=\"Nee\",0,\nIF(Uit_Proces_Invoer_Uitvoer_Dim=\"Invoer\",\nIF(Uit_Hout_Doorzet_MJ=0,0,Uit_Proces_Verbrandingsmotor_CO2T_kg/Uit_Hout_Doorzet_tonds),\nIF(Uit_Proces_Doorzet_MJ=0,0,Uit_Proces_Verbrandingsmotor_CO2T_kg/Uit_Proces_Doorzet_tonds)))","v":20.742175385618605},"kgCO2eq/tonds",null,"Uit_Proces_Verbrandingsmotor_CO2T_kg_tonds",null,null,null,null,null,null,"gCO2eq/tonds"]
[null,"CO2 Verbrandingsmotor",null,{"$f":"IF(Proces_Verbrandingsmotor_Ja_Nee=\"Nee\",0,\nUit_Proces_Verbrandingsmotor_Verbruik_MJ*Uit_Proces_Verbrandingsmotor_Emissie_CO2eq)","v":36655767.317913823},"gCO2eq","Uit_Proces_Verbrandingsmotor_CO2T_g"]
[null,"CO2 Verbrandingsmotor",null,{"$f":"IF(Proces_Verbrandingsmotor_Ja_Nee=\"Nee\",0,\nUit_Proces_Verbrandingsmotor_CO2T_g/1000)","v":36655.767317913822},"kgCO2eq","Uit_Proces_Verbrandingsmotor_CO2T_kg",null,null,null,null,null,null,null,"kgCO2eq"]
[null,"CO2 Verbrandingsmotor",null,{"$f":"IF(Proces_Verbrandingsmotor_Ja_Nee=\"Nee\",0,\nUit_Proces_Verbrandingsmotor_CO2T_kg/1000)","v":36.655767317913821},"tonCO2eq","Uit_Proces_Verbrandingsmotor_CO2T_ton",null,null,null,null,null,null,null,"tonCO2eq"]
[null,"CO2 Verbrandingsmotor",null,{"$f":"IF(Proces_Verbrandingsmotor_Ja_Nee=\"Nee\",0,\nUit_Proces_Verbrandingsmotor_CO2T_ton/1000)","v":3.6655767317913819E-2},"MtonCO2eq","Uit_Proces_Verbrandingsmotor_CO2T_Mton",null,null,null,null,null,null,null,"MtonCO2eq"]
[]
[]
[null,null,null,{"$f":"Uit_Proces_Verbrandingsmotor_CO2_Dim","v":"gCO2eq/MJ"},null,"Uit_Proces_Verbrandingsmotor_CO2_Dim"]
[null,"CO2_Verbrandingsmotor",null,{"$f":"IF(Proces_Verbrandingsmotor_Ja_Nee=\"Ja\",\nIF(Uit_Proces_Verbrandingsmotor_CO2_Dim=\"gCO2eq/MJ\",Uit_Proces_Verbrandingsmotor_CO2T_g_MJ,\nIF(Uit_Proces_Verbrandingsmotor_CO2_Dim=\"kgCO2eq/tonds\",Uit_Proces_Verbrandingsmotor_CO2T_kg_tonds,\nIF(Uit_Proces_Verbrandingsmotor_CO2_Dim=\"kgCO2eq\",Uit_Proces_Verbrandingsmotor_CO2T_kg,\nIF(Uit_Proces_Verbrandingsmotor_CO2_Dim=\"tonCO2eq\",Uit_Proces_Verbrandingsmotor_CO2T_ton,\nIF(Uit_Proces_Verbrandingsmotor_CO2_Dim=\"MtonCO2eq\",Uit_Proces_Verbrandingsmotor_CO2T_Mton,0))))),0)","v":1.0747241132444871},null,"Uit_Proces_Brandstof_CO2"]
[]
[]
[null,"Elektriciteit"]
[]
[null,"Elektromotor-Ja_Nee",null,{"$f":"Proces_Elektromotor_Ja_Nee","v":"Ja"},"-","Proces_Elektromotor_Ja_Nee"]
[null,"Verbruik of Vermogen",null,{"$f":"Proces_Elektromotor_Vermogen_Verbruik","v":"Verbruik"},null,"Proces_Elektromotor_Vermogen_Verbruik"]
[null,"Maschinetijd Elektromotor",null,{"$f":"IF(Proces_Elektromotor_Ja_Nee=\"Nee\",0,IF(Proces_Elektromotor_Vermogen_Verbruik=\"Verbruik\",0,IF(Proces_Elektromotor_Capaciteit_Dim=\"GJ/uur\",IF(Proces_Elektromotor_Capaciteit=0,0,Uit_Hout_Doorzet_GJ/Proces_Elektromotor_Capaciteit),\nIF(Proces_Elektromotor_Capaciteit_Dim=\"uur/GJ\",Proces_Elektromotor_Capaciteit*Uit_Hout_Doorzet_GJ,\nIF(Proces_Elektromotor_Capaciteit_Dim=\"MWh/uur\",IF(Proces_Elektromotor_Capaciteit=0,0,Uit_Hout_Doorzet_MWh/Proces_Elektromotor_Capaciteit),\nIF(Proces_Elektromotor_Capaciteit_Dim=\"uur/MWh\",Proces_Elektromotor_Capaciteit*Uit_Hout_Doorzet_MWh,\nIF(Proces_Elektromotor_Capaciteit_Dim=\"m3/uur\",IF(Proces_Elektromotor_Capaciteit=0,0,Uit_Hout_Doorzet_m3/Proces_Elektromotor_Capaciteit),\nIF(Proces_Elektromotor_Capaciteit_Dim=\"uur/m3\",Proces_Elektromotor_Capaciteit*Uit_Hout_Doorzet_m3,\nIF(Proces_Elektromotor_Capaciteit_Dim=\"liter/uur\",IF(Proces_Elektromotor_Capaciteit=0,0,Uit_Hout_Doorzet_liter/Proces_Elektromotor_Capaciteit),\nIF(Proces_Elektromotor_Capaciteit_Dim=\"uur/liter\",Proces_Elektromotor_Capaciteit*Uit_Hout_Doorzet_liter,\nIF(Proces_Elektromotor_Capaciteit_Dim=\"kg/uur\",IF(Proces_Elektromotor_Capaciteit=0,0,Uit_Hout_Doorzet_kg/Proces_Elektromotor_Capaciteit),\nIF(Proces_Elektromotor_Capaciteit_Dim=\"uur/kg\",Proces_Elektromotor_Capaciteit*Uit_Hout_Doorzet_kg,\nIF(Proces_Elektromotor_Capaciteit_Dim=\"kgds/uur\",IF(Proces_Elektromotor_Capaciteit=0,0,Uit_Hout_Doorzet_kgds/Proces_Elektromotor_Capaciteit),\nIF(Proces_Elektromotor_Capaciteit_Dim=\"uur/kgds\",Proces_Elektromotor_Capaciteit*Uit_Hout_Doorzet_kgds,\nIF(Proces_Elektromotor_Capaciteit_Dim=\"ton/uur\",IF(Proces_Elektromotor_Capaciteit=0,0,Uit_Hout_Doorzet_ton/Proces_Elektromotor_Capaciteit),\nIF(Proces_Elektromotor_Capaciteit_Dim=\"uur/ton\",Proces_Elektromotor_Capaciteit*Uit_Hout_Doorzet_ton,\nIF(Proces_Elektromotor_Capaciteit_Dim=\"tonds/uur\",IF(Proces_Elektromotor_Capaciteit=0,0,Uit_Hout_Doorzet_tonds/Proces_Elektromotor_Capaciteit),\nIF(Proces_Elektromotor_Capaciteit_Dim=\"uur/tonds\",Proces_Elektromotor_Capaciteit*Uit_Hout_Doorzet_tonds,\nIF(Proces_Elektromotor_Capaciteit_Dim=\"uur\",IF(Proces_Elektromotor_Capaciteit=0,0,Proces_Elektromotor_Capaciteit))))))))))))))))))))","v":0},"uur","Uit_Proces_Elektromotor_Tijd_uur",null,null,null,"uur"]
[null,"Maschinetijd",null,{"$f":"IF(Uit_Proces_Elektromotor_Tijd_uur=0,0,Uit_Hout_Doorzet_m3/Uit_Proces_Elektromotor_Tijd_uur)","v":0},"m3/uur","Uit_Proces_Elektromotor_Tijd_m3_uur",null,null,null,"m3/uur"]
[null,"Maschinetijd",null,{"$f":"IF(Uit_Proces_Elektromotor_Tijd_uur=0,0,Uit_Hout_Doorzet_ton/Uit_Proces_Elektromotor_Tijd_uur)","v":0},"ton/uur","Uit_Proces_Elektromotor_Tijd_ton_uur",null,null,null,"ton/uur"]
[null,"Maschinetijd",null,{"$f":"IF(Uit_Proces_Elektromotor_Tijd_uur=0,0,Uit_Hout_Doorzet_tonds/Uit_Proces_Elektromotor_Tijd_uur)","v":0},"tonds/uur","Uit_Proces_Elektromotor_Tijd_tonds_uur",null,null,null,"tonds/uur"]
[null,"Maschinetijd",null,{"$f":"IF(Uit_Proces_Elektromotor_Tijd_uur=0,0,Uit_Hout_Doorzet_GJ/Uit_Proces_Elektromotor_Tijd_uur)","v":0},"GJ/uur","Uit_Proces_Elektromotor_Tijd_GJ_uur",null,null,null,"GJ/uur"]
[null,"Maschinetijd",null,{"$f":"IF(Uit_Proces_Elektromotor_Tijd_uur=0,0,Uit_Hout_Doorzet_MWh/Uit_Proces_Elektromotor_Tijd_uur)","v":0},"MWh/uur","Uit_Proces_Elektromotor_Tijd_MWh_uur",null,null,null,"MWh/uur"]
[null,"Maschinetijd",null,{"$f":"IF(Uit_Proces_Elektromotor_Tijd_m3_uur=0,0,1/Uit_Proces_Elektromotor_Tijd_m3_uur)","v":0},"uur/m3","Uit_Proces_Elektromotor_Tijd_uur_m3",null,null,null,"uur/m3"]
[null,"Maschinetijd",null,{"$f":"IF(Uit_Proces_Elektromotor_Tijd_ton_uur=0,0,1/Uit_Proces_Elektromotor_Tijd_ton_uur)","v":0},"uur/ton","Uit_Proces_Elektromotor_Tijd_uur_ton",null,null,null,"uur/ton"]
[null,"Maschinetijd",null,{"$f":"IF(Uit_Proces_Elektromotor_Tijd_tonds_uur=0,0,1/Uit_Proces_Elektromotor_Tijd_tonds_uur)","v":0},"uur/tonds","Uit_Proces_Elektromotor_Tijd_uur_tonds",null,null,null,"uur/tonds"]
[null,"Maschinetijd",null,{"$f":"IF(Uit_Proces_Elektromotor_Tijd_GJ_uur=0,0,1/Uit_Proces_Elektromotor_Tijd_GJ_uur)","v":0},"uur/GJ","Uit_Proces_Elektromotor_Tijd_uur_GJ",null,null,null,"uur/GJ"]
[null,"Maschinetijd",null,{"$f":"IF(Uit_Proces_Elektromotor_Tijd_MWh_uur=0,0,1/Uit_Proces_Elektromotor_Tijd_MWh_uur)","v":0},"uur/MWh","Uit_Proces_Elektromotor_Tijd_uur_MWh",null,null,null,"uur/MWh"]
[]
[]
[null,"Aandrijving elektromotor",null,"Ja",null,"Proces_Elektromotor_Ja_Nee"]
[null,"Vermogen of Verbruik",null,"Verbruik",null,"Proces_Elektromotor_Vermogen_Verbruik_ID"]
[null,"Maschinetijd",null,{"$f":"IF(Proces_Elektromotor_Ja_Nee=\"Nee\",0,Uit_Proces_Elektromotor_Tijd_uur)","v":0},"uur","Uit_Proces_Elektromotor_Tijd_uur"]
[null,"Vermogen",null,{"$f":"IF(Proces_Elektromotor_Ja_Nee=\"Nee\",0,\nIF(Proces_Elektromotor_VermogenVerbruik_Dim=\"W\",Proces_Elektromotor_VermogenVerbruik/1000,\nIF(Proces_Elektromotor_VermogenVerbruik_Dim=\"kW\",Proces_Elektromotor_VermogenVerbruik,\nIF(Proces_Elektromotor_VermogenVerbruik_Dim=\"MW\",Proces_Elektromotor_VermogenVerbruik*1000,0))))","v":0},"kW","Uit_Proces_Elektromotor_Vermogen_kW"]
[null,"Loadfactor",null,{"$f":"Proces_Elektromotor_Loadfactor","v":0},"%","Proces_Elektromotor_Loadfactor"]
[null,"Stroomverbruik",null,{"$f":"IF(Proces_Elektromotor_Ja_Nee=\"Nee\",0,\nIF(Proces_Elektromotor_Vermogen_Verbruik=\"Vermogen\",Uit_Proces_Elektromotor_Vermogen_kW*Proces_Elektromotor_Loadfactor/100*Uit_Proces_Elektromotor_Tijd_uur,Proces_Elektromotor_VermogenVerbruik))","v":2500},"kWh","Uit_Proces_Elektromotor_Verbruik_kWh"]
[null,"Stroomverbruik",null,{"$f":"IF(Proces_Elektromotor_Ja_Nee=\"Nee\",0,Uit_Proces_Elektromotor_Verbruik_kWh/1000)","v":2.5},"MWh","Uit_Proces_Elektromotor_Verbruik_MWh"]
[null,"Stroomverbruik",null,{"$f":"IF(Proces_Elektromotor_Ja_Nee=\"Nee\",0,Uit_Proces_Elektromotor_Verbruik_MWh*3.6)","v":9},"GJ","Uit_Proces_Elektromotor_Verbruik_GJ"]
[]
[]
[null,"Stroomverbruik",null,{"$f":"Uit_Proces_Elektromotor_Verbruik_kWh","v":2500},"kWh","Uit_Proces_Elektromotor_Verbruik_MJ"]
[null,"CO2",null,{"$f":"IF(Proces_Elektromotor_Ja_Nee=\"Nee\",0,\nIF(Algemeen_Berekening_Methodiek_ID=\"EU\",LOOKUP(Proces_Elektromotor_Stroombron,Lijst_Elektriciteit_EU_Soort,Lijst_Elektriciteit_EU_CO2),\nIF(Algemeen_Berekening_Methodiek_ID=\"NL\",LOOKUP(Proces_Elektromotor_Stroombron,Lijst_Elektriciteit_NL_Soort,Lijst_Elektriciteit_NL_CO2),\nLOOKUP(Proces_Elektromotor_Stroombron,Lijst_Elektriciteit_NL_EU_Soort,Lijst_Elektriciteit_NL_EU_CO2))))","v":141},"g/MJ","Uit_Proces_Elektromotor_Emissie_CO2"]
[null,"CH4",null,{"$f":"IF(Proces_Elektromotor_Ja_Nee=\"Nee\",0,\nIF(Algemeen_Berekening_Methodiek_ID=\"EU\",LOOKUP(Proces_Elektromotor_Stroombron,Lijst_Elektriciteit_EU_Soort,Lijst_Elektriciteit_EU_CH4),\nIF(Algemeen_Berekening_Methodiek_ID=\"NL\",LOOKUP(Proces_Elektromotor_Stroombron,Lijst_Elektriciteit_EU_Soort,Lijst_Elektriciteit_NL_CH4),\nLOOKUP(Proces_Elektromotor_Stroombron,Lijst_Elektriciteit_NL_EU_Soort,Lijst_Elektriciteit_NL_EU_CH4))))","v":0.159},"g/MJ","Uit_Proces_Elektromotor_Emissie_CH4"]
[null,"N2O",null,{"$f":"IF(Proces_Elektromotor_Ja_Nee=\"Nee\",0,\nIF(Algemeen_Berekening_Methodiek_ID=\"EU\",LOOKUP(Proces_Elektromotor_Stroombron,Lijst_Elektriciteit_EU_Soort,Lijst_Elektriciteit_EU_N2O),\nIF(Algemeen_Berekening_Methodiek_ID=\"NL\",LOOKUP(Proces_Elektromotor_Stroombron,Lijst_Elektriciteit_EU_Soort,Lijst_Elektriciteit_NL_N2O),\nLOOKUP(Proces_Elektromotor_Stroombron,Lijst_Elektriciteit_NL_EU_Soort,Lijst_Elektriciteit_NL_EU_N2O))))","v":5.7499999999999999E-3},"g/MJ","Uit_Proces_Elektromotor_Emissie_N2O"]
[null,"CO2 - equivalent",null,{"$f":"Uit_Proces_Elektromotor_Emissie_CO2*JRC_GWP_CO2\n+Uit_Proces_Verbrandingsmotor_Emissie_CH4*JRC_GWP_CH4\n+Uit_Proces_Verbrandingsmotor_Emissie_N2O*JRC_GWP_N2O","v":141},"g/MJ","Uit_Proces_Elektromotor_Emissie_CO2"]
[]
[]
[null,"Doorzet invoer",null,{"$f":"Uit_Hout_Doorzet_GJ","v":34803.205530612242},"GJ","Uit_Hout_Doorzet_GJ"]
[null,"Doorzet uitvoer",null,{"$f":"Uit_Proces_Doorzet_GJ","v":34107.14142},"GJ","Uit_Proces_Doorzet_GJ"]
[null,"Doorzet invoer",null,{"$f":"Uit_Hout_Doorzet_tonds","v":1803.2748979591834},"tonds","Uit_Hout_Doorzet_tonds"]
[null,"Doorzet uitvoer",null,{"$f":"Uit_Proces_Doorzet_tonds","v":1767.2094},"tonds","Uit_Proces_Doorzet_tonds"]
[null,"Invoer / uitvoer?",null,{"$f":"Uit_Proces_Invoer_Uitvoer_Dim","v":"Uitvoer"},null,"Uit_Proces_Invoer_Uitvoer_Dim"]
[null,"CO2/Doorzet",null,{"$f":"IF(Proces_Verbrandingsmotor_Ja_Nee=\"Nee\",0,\nIF(Uit_Proces_Invoer_Uitvoer_Dim=\"Invoer\",\nIF(Uit_Hout_Doorzet_MJ=0,0,Uit_Proces_Elektromotor_CO2T_g/Uit_Hout_Doorzet_MJ),\nIF(Uit_Proces_Doorzet_MJ=0,0,Uit_Proces_Elektromotor_CO2T_g/Uit_Proces_Doorzet_MJ)))","v":3.720628429024176E-2},"gCO2eq/MJ","Uit_Proces_Elektromotor_CO2T_g_MJ"]
[null,"CO2 Elektromotor",null,{"$f":"IF(Proces_Elektromotor_Ja_Nee=\"Nee\",0,\nIF(Uit_Proces_Invoer_Uitvoer_Dim=\"Invoer\",\nIF(Uit_Hout_Doorzet_MJ=0,0,Uit_Proces_Elektromotor_CO2T_kg/Uit_Hout_Doorzet_tonds),\nIF(Uit_Proces_Doorzet_MJ=0,0,Uit_Proces_Elektromotor_CO2T_kg/Uit_Proces_Doorzet_tonds)))","v":0.71808128680166594},"kgCO2eq/tonds","Uit_Proces_Elektromotor_CO2T_kg_tonds"]
[null,"CO2 Elektromotor",null,{"$f":"IF(Proces_Elektromotor_Ja_Nee=\"Ja\",Uit_Proces_Elektromotor_Verbruik_GJ*1000*Uit_Proces_Elektromotor_Emissie_CO2eq,0)","v":1269000},"gCO2eq","Uit_Proces_Elektromotor_CO2T_g"]
[null,"CO2 Elektromotor",null,{"$f":"IF(Proces_Elektromotor_Ja_Nee=\"Ja\",Uit_Proces_Elektromotor_CO2T_g/1000,0)","v":1269},"kgCO2eq","Uit_Proces_Elektromotor_CO2T_kg"]
[null,"CO2 Elektromotor",null,{"$f":"IF(Proces_Elektromotor_Ja_Nee=\"Ja\",Uit_Proces_Elektromotor_CO2T_kg/1000,0)","v":1.2689999999999999},"tonCO2eq","Uit_Proces_Elektromotor_CO2T_ton"]
[null,"CO2 Elektromotor",null,{"$f":"IF(Proces_Elektromotor_Ja_Nee=\"Ja\",Uit_Proces_Elektromotor_CO2T_ton/1000,0)","v":1.2689999999999999E-3},"MtonCO2eq","Uit_Proces_Elektromotor_CO2T_Mton"]
[]
[]
[null,null,null,{"$f":"Uit_Proces_Verbrandingsmotor_CO2_Dim","v":"gCO2eq/MJ"},null,"Uit_Proces_Verbrandingsmotor_CO2_Dim"]
[null,"CO2_Elektromotor",null,{"$f":"IF(Proces_Elektromotor_Ja_Nee=\"Nee\"=0,0,\nIF(Uit_Proces_Verbrandingsmotor_CO2_Dim=\"gCO2eq/MJ\",Uit_Proces_Elektromotor_CO2T_g_MJ,\nIF(Uit_Proces_Verbrandingsmotor_CO2_Dim=\"kgCO2eq/tonds\",Uit_Proces_Elektromotor_CO2T_kg_tonds,\nIF(Uit_Proces_Verbrandingsmotor_CO2_Dim=\"kgCO2eq\",Uit_Proces_Elektromotor_CO2T_kg,\nIF(Uit_Proces_Verbrandingsmotor_CO2_Dim=\"tonCO2eq\",Uit_Proces_Elektromotor_CO2T_ton,\nIF(Uit_Proces_Verbrandingsmotor_CO2_Dim=\"MtonCO2eq\",Uit_Proces_Elektromotor_CO2T_Mton,0))))))","v":3.720628429024176E-2},null,"Uit_Proces_Stroom_CO2"]
[]
[]
[null,"Proces - Basis CO2",null,{"$f":"Proces_CO2_Productie_Basis","v":10000},{"$f":"Proces_CO2_Productie_Basis_Dim","v":"kgCO2eq"}]
[null,null,null,{"$f":"IF(Uit_Proces_Invoer_Uitvoer_Dim=\"Invoer\",\nIF(Proces_CO2_Productie_Basis_Dim=\"gCO2eq/MJ\",Proces_CO2_Productie_Basis,\nIF(Proces_CO2_Productie_Basis_Dim=\"kgCO2eq/tonds\",IF(Proces_LHVds=0,0,Proces_CO2_Productie_Basis/Proces_LHVds),\nIF(Proces_CO2_Productie_Basis_Dim=\"kgCO2eq\",IF(Uit_Hout_Doorzet_MJ=0,0,Proces_CO2_Productie_Basis/Uit_Hout_Doorzet_MJ*1000),\nIF(Proces_CO2_Productie_Basis_Dim=\"tonCO2eq\",IF(Uit_Hout_Doorzet_MJ=0,0,Proces_CO2_Productie_Basis/Uit_Hout_Doorzet_MJ*1000*1000),\nIF(Proces_CO2_Productie_Basis_Dim=\"MtonCO2eq\",IF(Uit_Hout_Doorzet_MJ=0,0,Proces_CO2_Productie_Basis/Uit_Hout_Doorzet_MJ*1000*1000*1000),))))),\nIF(Proces_CO2_Productie_Basis_Dim=\"gCO2eq/MJ\",Proces_CO2_Productie_Basis,\nIF(Proces_CO2_Productie_Basis_Dim=\"kgCO2eq/tonds\",IF(Proces_LHVds=0,0,Proces_CO2_Productie_Basis/Proces_LHVds),\nIF(Proces_CO2_Productie_Basis_Dim=\"kgCO2eq\",IF(Uit_Proces_Doorzet_MJ=0,0,Proces_CO2_Productie_Basis/Uit_Proces_Doorzet_MJ*1000),\nIF(Proces_CO2_Productie_Basis_Dim=\"tonCO2eq\",IF(Uit_Proces_Doorzet_MJ=0,0,Proces_CO2_Productie_Basis/Uit_Proces_Doorzet_MJ*1000*1000),\nIF(Proces_CO2_Productie_Basis_Dim=\"MtonCO2eq\",IF(Uit_Proces_Doorzet_MJ=0,0,Proces_CO2_Productie_Basis/Uit_Proces_Doorzet_MJ*1000*1000*1000),0))))))","v":0.29319372963153473},"gCO2eq/MJ","Uit_Proces_Basis_CO2T_g_MJ",null,null,null,"gCO2eq/MJ"]
[null,null,null,{"$f":"IF(Uit_Proces_Invoer_Uitvoer_Dim=\"Invoer\",\nIF(Uit_Hout_Doorzet_tonds=0,0,Uit_Proces_Basis_CO2T_kg/Uit_Hout_Doorzet_tonds),\nIF(Uit_Proces_Doorzet_tonds=0,0,Uit_Proces_Basis_CO2T_kg/Uit_Proces_Doorzet_tonds))","v":5.6586389818886209},"kgCO2eq/tonds","Uit_Proces_Basis_CO2T_kg_tonds",null,null,null,"kgCO2eq/tonds"]
[null,null,null,{"$f":"Uit_Proces_Basis_CO2T_g_MJ*IF(Uit_Proces_Invoer_Uitvoer_Dim=\"Invoer\",Uit_Hout_Doorzet_MJ,Uit_Proces_Doorzet_MJ)/1000","v":10000},"kgCO2eq","Uit_Proces_Basis_CO2T_kg",null,null,null,"kgCO2eq"]
[null,null,null,{"$f":"Uit_Proces_Basis_CO2T_g_MJ*IF(Uit_Proces_Invoer_Uitvoer_Dim=\"Invoer\",Uit_Hout_Doorzet_MJ,Uit_Proces_Doorzet_MJ)/1000/1000","v":10},"tonCO2eq","Uit_Proces_Basis_CO2T_ton",null,null,null,"tonCO2eq"]
[null,null,null,{"$f":"Uit_Proces_Basis_CO2T_g_MJ*IF(Uit_Proces_Invoer_Uitvoer_Dim=\"Invoer\",Uit_Hout_Doorzet_MJ,Uit_Proces_Doorzet_MJ)/1000/1000/1000","v":0.01},"MtonCO2eq","Uit_Proces_Basis_CO2T_Mton",null,null,null,"MtonCO2eq"]
[]
[null,null,null,{"$f":"IF(Uit_Proces_Verbrandingsmotor_CO2_Dim=\"gCO2eq/MJ\",Uit_Proces_Basis_CO2T_g_MJ,\nIF(Uit_Proces_Verbrandingsmotor_CO2_Dim=\"kgCO2eq/tonds\",Uit_Proces_Basis_CO2T_kg_tonds,\nIF(Uit_Proces_Verbrandingsmotor_CO2_Dim=\"kgCO2eq\",Uit_Proces_Basis_CO2T_kg,\nIF(Uit_Proces_Verbrandingsmotor_CO2_Dim=\"tonCO2eq\",Uit_Proces_Basis_CO2T_ton,\nIF(Uit_Proces_Verbrandingsmotor_CO2_Dim=\"MtonCO2eq\",Uit_Proces_Basis_CO2T_Mton)))))","v":0.29319372963153473},{"$f":"Uit_Proces_Verbrandingsmotor_CO2_Dim","v":"gCO2eq/MJ"},"Uit_Proces_Verbrandingsmotor_CO2_Dim"]
[]
[null,"CO2 op invoer / uitvoer",null,{"$f":"Uit_Proces_Invoer_Uitvoer_Dim","v":"Uitvoer"}]
[null,"CO2 Verbrandingsmotor",null,{"$f":"IF(Proces_Verbrandingsmotor_Ja_Nee=\"Nee\",0,Uit_Proces_Brandstof_CO2)","v":1.0747241132444871},{"$f":"Uit_Proces_Verbrandingsmotor_CO2_Dim","v":"gCO2eq/MJ"}]
[null,"CO2 Elektromotor",null,{"$f":"IF(Proces_Elektromotor_Ja_Nee=\"Nee\",0,Uit_Proces_Stroom_CO2)","v":3.720628429024176E-2},{"$f":"Uit_Proces_Verbrandingsmotor_CO2_Dim","v":"gCO2eq/MJ"}]
[null,"CO2 Basis",null,{"$f":"Uit_Proces_Basis_CO2","v":0.29319372963153473},{"$f":"Uit_Proces_Verbrandingsmotor_CO2_Dim","v":"gCO2eq/MJ"}]
[null,"CO2 Totaal",null,{"$f":"SUM(D381:D383)","v":1.4051241271662638},{"$f":"Uit_Proces_Verbrandingsmotor_CO2_Dim","v":"gCO2eq/MJ"}]
[]
[null,"Samenvatting Proces",{"$f":"ROW()","v":386},null,null,null,null,null,null,null,null,null,null,null,{"$f":"B386","v":"Samenvatting Proces"}]
[]
[null,null,null,{"$f":"Samenvatting_Proces_Doorzet_Dim","v":"MJ"},null,"Samenvatting_Proces_Doorzet_Dim"]
[null,"Doorzet",null,{"$f":"IF(Samenvatting_Proces_Doorzet_Dim=\"m3\",Uit_Proces_Doorzet_m3,\nIF(Samenvatting_Proces_Doorzet_Dim=\"kg\",Uit_Proces_Doorzet_kg,\nIF(Samenvatting_Proces_Doorzet_Dim=\"kgds\",Uit_Proces_Doorzet_kgds,\nIF(Samenvatting_Proces_Doorzet_Dim=\"ton\",Uit_Proces_Doorzet_ton,\nIF(Samenvatting_Proces_Doorzet_Dim=\"tonds\",Uit_Proces_Doorzet_tonds,\nIF(Samenvatting_Proces_Doorzet_Dim=\"MJ\",Uit_Proces_Doorzet_MJ,\nIF(Samenvatting_Proces_Doorzet_Dim=\"GJ\",Uit_Proces_Doorzet_GJ,\nIF(Samenvatting_Proces_Doorzet_Dim=\"MWh\",Uit_Proces_Doorzet_MWh,\nIF(Samenvatting_Proces_Doorzet_Dim=\"kWh\",Uit_Proces_Doorzet_kWh,\"Berekening Samenvatting Proces Doorzet\")))))))))","v":34107141.420000002},null,"Samenvatting_Proces_Doorzet"]
[null,null,null,null,{"$f":"Uit_Proces_Verbrandingsmotor_CO2_Dim","v":"gCO2eq/MJ"}]
[null,"CO2 op invoer / uitvoer",null,{"$f":"Uit_Proces_Invoer_Uitvoer_Dim","v":"Uitvoer"}]
[]
[null,"CO2 Totaal",null,{"$f":"IF(Uit_Proces_Invoer_Uitvoer_Dim=\"Invoer\",\nIF(Uit_Hout_Doorzet_MJ=0,0,Uit_Proces_CO2T_g/Uit_Hout_Doorzet_MJ),\nIF(Uit_Proces_Doorzet_MJ=0,0,Uit_Proces_CO2T_g/Uit_Proces_Doorzet_MJ))","v":1.4051241271662638},"gCO2eq/MJ",null,"Uit_Proces_CO2T_g_MJ",null,null,null,"gCO2eq/MJ"]
[null,"CO2 Totaal",null,{"$f":"IF(Uit_Proces_Invoer_Uitvoer_Dim=\"Invoer\",\nIF(Uit_Hout_Doorzet_tonds=0,0,Uit_Proces_CO2T_kg/Uit_Hout_Doorzet_tonds),\nIF(Uit_Proces_Doorzet_tonds=0,0,Uit_Proces_CO2T_kg/Uit_Proces_Doorzet_tonds))","v":27.11889565430889},"kgCO2eq/tonds",null,"Uit_Proces_CO2T_kg_tonds",null,null,null,"kgCO2eq/tonds"]
[null,"CO2 Totaal",null,{"$f":"IF(Uit_Proces_Invoer_Uitvoer_Dim=\"Invoer\",\nIF(Uit_Proces_Verbrandingsmotor_CO2_Dim=\"gCO2eq/MJ\",Uit_Proces_CO2T*Uit_Hout_Doorzet_MJ,\nIF(Uit_Proces_Verbrandingsmotor_CO2_Dim=\"kgCO2eq/tonds\",Uit_Proces_CO2T*1000*Uit_Hout_Doorzet_tonds,\nIF(Uit_Proces_Verbrandingsmotor_CO2_Dim=\"kgCO2eq\",Uit_Proces_CO2T/1000,\nIF(Uit_Proces_Verbrandingsmotor_CO2_Dim=\"tonCO2eq\",Uit_Proces_CO2T/1000/1000,\nIF(Uit_Proces_Verbrandingsmotor_CO2_Dim=\"MtonCO2eq\",Uit_Proces_CO2T/1000/1000/1000))))),\nIF(Uit_Proces_Verbrandingsmotor_CO2_Dim=\"gCO2eq/MJ\",Uit_Proces_CO2T*Uit_Proces_Doorzet_MJ,\nIF(Uit_Proces_Verbrandingsmotor_CO2_Dim=\"kgCO2eq/tonds\",Uit_Proces_CO2T*1000*Uit_Proces_Doorzet_tonds,\nIF(Uit_Proces_Verbrandingsmotor_CO2_Dim=\"kgCO2eq\",Uit_Proces_CO2T/1000,\nIF(Uit_Proces_Verbrandingsmotor_CO2_Dim=\"tonCO2eq\",Uit_Proces_CO2T/1000/1000,\nIF(Uit_Proces_Verbrandingsmotor_CO2_Dim=\"MtonCO2eq\",Uit_Proces_CO2T/1000/1000/1000,0))))))","v":47924767.317913823},"gCO2eq",null,"Uit_Proces_CO2T_g"]
[null,"CO2 Totaal",null,{"$f":"Uit_Proces_CO2T_g/1000","v":47924.767317913822},"kgCO2eq",null,"Uit_Proces_CO2T_kg",null,null,null,"kgCO2eq"]
[null,"CO2 Totaal",null,{"$f":"Uit_Proces_CO2T_kg/1000","v":47.924767317913819},"tonCO2eq",null,"Uit_Proces_CO2T_ton",null,null,null,"tonCO2eq"]
[null,"CO2 Totaal",null,{"$f":"Uit_Proces_CO2T_ton/1000","v":4.792476731791382E-2},"MtonCO2eq",null,"Uit_Proces_CO2T_Mton",null,null,null,"MtonCO2eq"]
[null,null,null,null,null,null,null,null,null,null,null,null,null,"gCO2eq"]
[null,"CO2 productie Proces",null,{"$f":"Samenvatting_Proces_CO2T_Dim","v":"gCO2eq"},null,"Samenvatting_Proces_CO2_Dim",null,null,null,null,null,null,null,"kgCO2eq"]
[null,null,null,{"$f":"IF(Samenvatting_Proces_CO2T_Dim=\"gCO2eq\",Uit_Proces_CO2T_g,\nIF(Samenvatting_Proces_CO2T_Dim=\"kgCO2eq\",Uit_Proces_CO2T_kg,\nIF(Samenvatting_Proces_CO2T_Dim=\"tonCO2eq\",Uit_Proces_CO2T_ton,\nIF(Samenvatting_Proces_CO2T_Dim=\"MtonCO2eq\",Uit_Proces_CO2T_Mton))))","v":47924767.317913823},null,"Samenvatting_Proces_CO2T",null,null,null,null,null,null,null,"tonCO2eq"]
[null,null,null,null,null,null,null,null,null,null,null,null,null,"MtonCO2eq"]
[]
[null,"Transport",{"$f":"ROW()","v":404}]
[]
[null,"Houteigenschappen Transport",{"$f":"ROW()","v":406},null,null,null,null,null,null,null,null,null,null,null,{"$f":"B406","v":"Houteigenschappen Transport"}]
[]
[null,"Omschrijving",null,"Waarde","Dimensie","Naam",null,null,null,"Hout","Proces"]
[null,null,null,null,null,null,null,null,null,"Hout","Proces","Transport"]
[null,"Houtsoort",null,{"$f":"Hout_Soort","v":"Loofhout mix NL"},"-","Hout_Soort",null,null,"Soort"]
[null,"Vochtigheid",null,{"$f":"Proces_Vochtigheid","v":50},"%","Proces_Vochtigheid",null,null,{"$f":"B411","v":"Vochtigheid"},{"$f":"Hout_Vochtigheid","v":50},null,{"$f":"Proces_Vochtigheid","v":50},"%"]
[null,"Δ vochtigheid ",null,{"$f":"Transport_Delta_Vochtigheid","v":0},"%","Transport_Delta_Vochtigheid",null,null,{"$f":"B412","v":"Δ vochtigheid "},null,{"$f":"Proces_Delta_Vochtigheid","v":0},{"$f":"Transport_Delta_Vochtigheid","v":0},"%"]
[null,"Vochtigheid",null,{"$f":"Proces_Vochtigheid+Transport_Delta_Vochtigheid","v":50},"%","Transport_Vochtigheid",null,null,{"$f":"B413","v":"Vochtigheid"},{"$f":"J411","v":50},{"$f":"Proces_Vochtigheid","v":50},{"$f":"Transport_Vochtigheid","v":50},"%",{"$f":"J413-K413","v":0},{"$f":"K413-L413","v":0}]
[null,null,null,null,null,null,null,null,null,"Hout","Proces",null,null,"Delta","Delta"]
[null,"RHO-0",null,{"$f":"Hout_RHO_0","v":633},"kg/m3","Transport_RHO_0",null,null,{"$f":"B415","v":"RHO-0"},{"$f":"Hout_RHO_0","v":633},{"$f":"Proces_RHO_0","v":633},{"$f":"Transport_RHO_0","v":633},"kg/m3",{"$f":"J415-K415","v":0},0]
[null,"Krimp",null,{"$f":"Hout_Krimp","v":15.4},"%","Transport_Krimp",null,null,{"$f":"B416","v":"Krimp"},{"$f":"Hout_Krimp","v":15.4},{"$f":"Proces_Krimp","v":15.4},{"$f":"Transport_Krimp","v":15.4},"%",0,0]
[null,"Vezel verzadigingspunt",null,{"$f":"Hout_Krimp_Hs","v":23},"%","Transport_Krimp_Hs",null,null,"Vezel verzadigingspunt",{"$f":"Hout_Krimp_Hs","v":23},{"$f":"Proces_Krimp_Hs","v":23},{"$f":"Transport_Krimp_Hs","v":23},"%",0,0]
[null,"RHO Volume Factor=1",null,{"$f":"IF(Transport_Vochtigheid>Transport_Krimp_Hs,Transport_RHO_0*(1-Transport_Krimp/100)/(1-Transport_Vochtigheid/100),Transport_RHO_0*(1-Transport_Vochtigheid/Transport_Krimp_Hs*Transport_Krimp/100)/(1-Transport_Vochtigheid/100))","v":1071.0360000000001},"m3","Transport_RHO_VF1",null,null,"RHO Volume Factor=1",{"$f":"Hout_RHO_VF1","v":1071.0360000000001},{"$f":"Proces_RHO_VF1","v":1071.0360000000001},{"$f":"Transport_RHO_VF1","v":1071.0360000000001},"m3",0,0]
[null,"Massa hout",null,{"$f":"Transport_RHO_VF1*(1-Transport_Vochtigheid/100)","v":535.51800000000003},"kg","Transport_Massa",null,null,"Massa hout",{"$f":"Hout_Massa","v":535.51800000000003},{"$f":"Proces_Massa","v":535.51800000000003},{"$f":"Transport_Massa","v":535.51800000000003},"kg",0,0]
[null,"Massa water",null,{"$f":"Transport_RHO_VF1*Transport_Vochtigheid/100","v":535.51800000000003},"kg","Transport_Water",null,null,"Massa water",{"$f":"Hout_Water","v":535.51800000000003},{"$f":"Proces_Water","v":535.51800000000003},{"$f":"Transport_Water","v":535.51800000000003},"kg",0,0]
[null,"Totale massa",null,{"$f":"Transport_Massa+Transport_Water","v":1071.0360000000001},"kg","Transport_Massa_Water",null,null,"Totale massa",{"$f":"Hout_Massa_Water","v":1071.0360000000001},{"$f":"Proces_Massa_Water","v":1071.0360000000001},{"$f":"Transport_Massa_Water","v":1071.0360000000001},"kg",0,0]
[]
[null,"Volume soort",null,{"$f":"Proces_Vorm","v":"Chips G50/P31,5"},null,"Transport_Vorm",null,null,null,{"$f":"D335","v":0},{"$f":"D423","v":"Chips G50/P31,5"},{"$f":"Proces_Vorm","v":"Chips G50/P31,5"}]
[null,"Volume Type Factor",null,{"$f":"LOOKUP(Proces_Vorm,Lijst_Volume_Vorm,Lijst_Volume_Vorm_Factor)","v":0.33},null,"Transport_Vorm_Vulling",null,null,{"$f":"B424","v":"Volume Type Factor"},{"$f":"Hout_Vorm_Vulling","v":0.3},{"$f":"Proces_Vorm_Vulling","v":0.33},{"$f":"Transport_Vorm_Vulling","v":0.33},"m3/m3",{"$f":"J424-K424","v":-3.0000000000000027E-2},{"$f":"K424-L424","v":0}]
[null,"RHO bij Volume Factor",null,{"$f":"Transport_RHO_VF1*Transport_Vorm_Vulling","v":353.44188000000003},null,"Transport_RHO",null,null,{"$f":"B425","v":"RHO bij Volume Factor"},{"$f":"Hout_RHO","v":321.31080000000003},{"$f":"Proces_RHO","v":353.44188000000003},{"$f":"Transport_RHO","v":353.44188000000003},"kg/m3",{"$f":"J425-K425","v":-32.131079999999997},{"$f":"K425-L425","v":0}]
[]
[null,"HHV-ds",null,{"$f":"Hout_HHVds","v":19.3},"GJ/ton","Transport_HHVds",null,null,"HHV-ds",{"$f":"Hout_HHVds","v":19.3},{"$f":"Proces_HHVds","v":19.3},{"$f":"Transport_HHVds","v":19.3},"GJ/ton",{"$f":"J427-K427","v":0},0]
[null,"H2",null,{"$f":"Hout_H2","v":6},"%","Transport_H2",null,null,"H2",{"$f":"Hout_H2","v":6},{"$f":"Proces_H2","v":6},{"$f":"Transport_H2","v":6},"%",0,0]
[null,"Berekening LHVds",null,{"$f":"LHV_Vochtigheid","v":1},"-","LHV_Vochtigheid"]
[null,"Berekening LHVds",null,{"$f":"LHV_Vochtigheid_Verdampingswarmte","v":0},null,"LHV_Vochtigheid_Verdampingswarmte"]
[null,"Berekening LHVds",null,{"$f":"LHV_Vochtigheid_Verdampingswarmte_H2","v":0},null,"LHV_Vochtigheid_Verdampingswarmte_H2"]
[null,"LHV-ds",null,{"$f":"Transport_HHVds","v":19.3},"GJ/tonds","Transport_LHVds",null,null,"LHV-ds",{"$f":"Hout_LHVds","v":19.3},{"$f":"Proces_LHVds","v":19.3},{"$f":"Transport_LHVds","v":19.3},"GJ/tonds",0,0]
[null,"LHV-Hm",null,{"$f":"LHV_Vochtigheid*Transport_HHVds*(1-Transport_Vochtigheid/100)\n-LHV_Vochtigheid_Verdampingswarmte*2.447*Transport_Vochtigheid/100\n-LHV_Vochtigheid_Verdampingswarmte_H2*Transport_H2/(100*2)*18.02*2.447*(1-Transport_Vochtigheid/100)","v":9.65},"GJ/ton","Transport_LHVm",null,null,"LHV-Hm",{"$f":"Hout_LHVm","v":9.65},{"$f":"Proces_LHVm","v":9.65},{"$f":"Transport_LHVm","v":9.65},"GJ/ton",0,0]
[null,"LHV-Hv",null,{"$f":"Transport_LHVm*Transport_RHO/1000","v":3.4107141420000002},"GJ/m3","Transport_LHVv",null,null,"LHV-Hv",{"$f":"Hout_LHVv","v":3.1006492200000002},{"$f":"Proces_LHVv","v":3.4107141420000002},{"$f":"Transport_LHVv","v":3.4107141420000002},"GJ/m3",-0.31006492200000002,0]
[]
[null,null,null,{"$f":"IF(Transport_LHVv_Dim=\"GJ/m3\",Transport_LHVv,Transport_LHVv/3.6)","v":3.4107141420000002},{"$f":"Proces_LHVv_Dim","v":"GJ/m3"},"Uit_Transport_LHVv",null,null,null,{"$f":"Uit_Hout_LHVv","v":0.86129145000000007},{"$f":"Uit_Proces_LHVv","v":3.4107141420000002},{"$f":"Uit_Transport_LHVv","v":3.4107141420000002},{"$f":"Proces_LHVv_Dim","v":"GJ/m3"},{"$f":"J436-K436","v":-2.5494226920000003},{"$f":"K436-L436","v":0}]
[null,null,null,{"$f":"IF(Hout_LHVm_Dim=\"GJ/ton\",Hout_LHVm,\nIF(Hout_LHVm_Dim=\"MWh/ton\",Hout_LHVm/3.6,\nIF(Hout_LHVm_Dim=\"GJ/tonds\",Hout_LHVds,\nIF(Hout_LHVm_Dim=\"MWh/tonds\",Hout_LHVds/3.6,\"berekening LHVm\"))))","v":9.65},{"$f":"Proces_LHVm_Dim","v":"GJ/ton"},"Uit_Transport_LHVm",null,null,null,{"$f":"Uit_Hout_LHVm","v":9.65},{"$f":"Uit_Proces_LHVm","v":9.65},{"$f":"Uit_Transport_LHVm","v":9.65},{"$f":"Proces_LHVm_Dim","v":"GJ/ton"},{"$f":"J437-K437","v":0},{"$f":"K437-L437","v":0}]
[]
[null,"Transport - Doorzet",{"$f":"ROW()","v":439},null,null,null,null,null,null,"Hout","Proces",null,null,null,{"$f":"B439","v":"Transport - Doorzet"}]
[]
[null,null,null,null,null,null,null,null,null,null,null,null,null,null,null,null,null,{"$f":"IF(Hout_Oogst_Eindgebruiker=\"naar eindgebruiker\",Uit_Hout_Doorzet_Oogst_Eindgebruiker_tonds,Uit_Proces_Doorzet_tonds*(100+Transport_Houtverlies)/100)","v":1606.5539999999999}]
[null,"Doorzet Proces --> Transport",null,{"$f":"Proces_Doorzet","v":10000},null,"Proces_Doorzet",null,null,"Doorzet Hout",{"$f":"D290","v":9.3387755102040817}]
[null,"Doorzet Hout Dim",null,{"$f":"Hout_Doorzet_Dim","v":"m3"},null,"Proces_Doorzet_Dim",null,null,"Doorzet Hout Dim"]
[null,"Houtverlies",null,{"$f":"Transport_Houtverlies","v":0},null,"Transport_Houtverlies",null,null,"Houtverlies",null,{"$f":"D444","v":0}]
[null,"Houtverlies Modus",null,{"$f":"Proces_Houtverlies_Modus","v":"%"},null,"Transport_Houtverlies_Modus",null,null,"Houtverlies Modus"]
[null,"Houtverlies Modus Dim",null,{"$f":"IF(Hout_Oogst_Eindgebruiker=\"naar eindgebruiker\",Hout_Doorzet_Dim,\"tonds\")","v":"m3"},null,null,null,null,"Houtverlies Modus Dim"]
[null,"Doorzet Transport",null,{"$f":"IF(Hout_Oogst_Eindgebruiker=\"naar eindgebruiker\",Hout_Doorzet_Oogst_Eindgebruiker,Uit_Proces_Doorzet_tonds*(100+Transport_Houtverlies)/100)","v":10000},null,"Uit_Transport_Doorzet",null,null,"Doorzet Proces",{"$f":"D290","v":9.3387755102040817},{"$f":"Uit_Proces_Doorzet","v":1767.2094}]
[null,null,null,null,null,null,null,null,null,"Hout","Proces","Transport",null,null,"%","Controle"]
[null,"Doorzet-EMV",null,{"$f":"Uit_Transport_Doorzet_GJ/Transport_LHVv","v":10000},"m3","Uit_Transport_Doorzet_m3",null,null,"Doorzet",{"$f":"Uit_Hout_Doorzet_m3","v":11224.489795918365},{"$f":"Uit_Proces_Doorzet_m3","v":10000},{"$f":"Uit_Transport_Doorzet_m3","v":10000},"m3",{"$f":"J449-K449","v":1224.4897959183654},{"$f":"(K449-J449)/J449*100","v":-10.909090909090894},{"$f":"Uit_Transport_Doorzet_m3*Transport_LHVv","v":34107.14142},"GJ"]
[null,"Doorzet-EMV",null,{"$f":"Uit_Transport_Doorzet_GJ/Transport_LHVm*1000","v":3534418.8},"kg","Uit_Transport_Doorzet_kg",null,null,"Doorzet",{"$f":"Uit_Hout_Doorzet_kg","v":3606549.7959183669},{"$f":"Uit_Proces_Doorzet_kg","v":3534418.8},{"$f":"Uit_Transport_Doorzet_kg","v":3534418.8},"kg",72130.995918367058,-1.9999999999999925,{"$f":"Uit_Transport_Doorzet_kg*Transport_LHVm/1000","v":34107.14142},"GJ"]
[null,"Doorzet-EMV",null,{"$f":"Uit_Transport_Doorzet_kg*(1-Transport_Vochtigheid/100)","v":1767209.4},"kgds","Uit_Transport_Doorzet_kgds",null,null,"Doorzet",{"$f":"Uit_Hout_Doorzet_kgds","v":1803274.8979591834},{"$f":"Uit_Proces_Doorzet_kgds","v":1767209.4},{"$f":"Uit_Transport_Doorzet_kgds","v":1767209.4},"kgds",36065.497959183529,-1.9999999999999925,{"$f":"Uit_Transport_Doorzet_kgds/(1-Transport_Vochtigheid/100)*Transport_LHVm/1000","v":34107.14142},"GJ"]
[null,"Doorzet-EMV",null,{"$f":"Uit_Transport_Doorzet_GJ/Transport_LHVm","v":3534.4187999999999},"ton","Uit_Transport_Doorzet_ton",null,null,"Doorzet",{"$f":"Uit_Hout_Doorzet_ton","v":3606.5497959183667},{"$f":"Uit_Proces_Doorzet_ton","v":3534.4187999999999},{"$f":"Uit_Transport_Doorzet_ton","v":3534.4187999999999},"ton",72.130995918366807,-1.9999999999999856,{"$f":"Uit_Transport_Doorzet_ton*Transport_LHVm","v":34107.14142},"GJ"]
[null,"Doorzet-EMV",null,{"$f":"Uit_Transport_Doorzet_GJ/Transport_LHVds","v":1767.2094},"tonds","Uit_Transport_Doorzet_tonds",null,null,"Doorzet",{"$f":"Uit_Hout_Doorzet_tonds","v":1803.2748979591834},{"$f":"Uit_Proces_Doorzet_tonds","v":1767.2094},{"$f":"Uit_Transport_Doorzet_tonds","v":1767.2094},"tonds",36.065497959183404,-1.9999999999999856,{"$f":"Uit_Transport_Doorzet_tonds*Transport_LHVm/(1-Transport_Vochtigheid/100)","v":34107.14142},"GJ"]
[null,"Doorzet-EMV",null,{"$f":"Uit_Transport_Doorzet_GJ*1000","v":34107141.420000002},"MJ","Uit_Transport_Doorzet_MJ",null,null,"Doorzet",{"$f":"Uit_Hout_Doorzet_GJ","v":34803.205530612242},{"$f":"Uit_Proces_Doorzet_GJ","v":34107.14142},{"$f":"Uit_Transport_Doorzet_GJ","v":34107.14142},"GJ",696.06411061224208,-1.999999999999992,{"$f":"Uit_Transport_Doorzet_GJ","v":34107.14142},"GJ"]
[null,"Doorzet-EMV",null,{"$f":"IF(D446=\"m3\",Uit_Transport_Doorzet*Transport_LHVv,\nIF(D446=\"kg\",Uit_Transport_Doorzet*Transport_LHVm/1000,\nIF(D446=\"kgds\",Uit_Transport_Doorzet*Transport_LHVds/1000,\nIF(D446=\"ton\",Uit_Transport_Doorzet*Transport_LHVm,\nIF(D446=\"tonds\",Uit_Transport_Doorzet*Transport_LHVds,\nIF(D446=\"GJ\",Uit_Transport_Doorzet,\nIF(D446=\"MJ\",Uit_Transport_Doorzet/1000,\nIF(D446=\"MWh\",Uit_Transport_Doorzet*3.6,\nIF(D446=\"kWh\",Uit_Transport_Doorzet*3.6/1000,\"Transport-Doorzet-GJ\")))))))))","v":34107.14142},"GJ","Uit_Transport_Doorzet_GJ",null,null,"Doorzet",{"$f":"Uit_Hout_Doorzet_MJ","v":34803205.530612245},{"$f":"Uit_Proces_Doorzet_MJ","v":34107141.420000002},{"$f":"Uit_Transport_Doorzet_MJ","v":34107141.420000002},"MJ",696064.11061224341,-1.9999999999999958,{"$f":"Uit_Transport_Doorzet_MJ/1000","v":34107.14142},"GJ"]
[null,"Doorzet-EMV",null,{"$f":"Uit_Transport_Doorzet_GJ/3.6*1000","v":9474205.9499999993},"kWh","Uit_Transport_Doorzet_kWh",null,null,"Doorzet",{"$f":"Uit_Hout_Doorzet_MWh","v":9667.5570918367339},{"$f":"Uit_Proces_Doorzet_MWh","v":9474.2059499999996},{"$f":"Uit_Transport_Doorzet_MWh","v":9474.2059499999996},"MWh",193.35114183673431,-1.9999999999999962,{"$f":"Uit_Transport_Doorzet_MWh*3.6","v":34107.14142},"GJ"]
[null,"Doorzet-EMV",null,{"$f":"Uit_Transport_Doorzet_GJ/3.6","v":9474.2059499999996},"MWh","Uit_Transport_Doorzet_MWh",null,null,"Doorzet",{"$f":"Uit_Hout_Doorzet_kWh","v":9667557.0918367337},{"$f":"Uit_Proces_Doorzet_kWh","v":9474205.9499999993},{"$f":"Uit_Transport_Doorzet_kWh","v":9474205.9499999993},"kWh",193351.14183673449,-1.999999999999998,{"$f":"Uit_Transport_Doorzet_kWh*3.6/1000","v":34107.14142},"GJ"]
[null,null,"De doorzet wordt in eerste instantie berekend voor GJ"]
[null,null,"Daaruit worden de andere dimensies berekend"]
[]
[]
[]
[null,"Transport Aandrijving CO2",{"$f":"ROW()","v":463},null,null,null,null,null,null,null,null,null,null,null,{"$f":"B463","v":"Transport Aandrijving CO2"}]
[]
[null,"Afstand - enkele reis",null,{"$f":"Transport_Afstand","v":50},"km","Transport_Afstand"]
[null,"Laadruimte",null,{"$f":"Transport_Laadruimte_m3","v":90},"m3","Transport_Laadruimte_m3"]
[null,"Laadvermogen",null,{"$f":"Transport_Laadvermogen_ton","v":25},"ton","Transport_Laadvermogen_ton"]
[null,"Dichtheid biomassa",null,{"$f":"Transport_RHO","v":353.44188000000003},"kg/m3","Transport_RHO"]
[null,"Gewicht bij laadruimte",null,{"$f":"Transport_Laadruimte_m3*Transport_RHO/1000","v":31.809769200000002},"ton","Transport_Laadgewicht_Laadruimte"]
[null,"Belading",null,{"$f":"MIN(Transport_Laadvermogen_ton,Transport_Laadgewicht_Laadruimte)","v":25},null,"Transport_Belading_ton"]
[]
[null,"Doorzet",null,{"$f":"Uit_Transport_Doorzet_m3","v":10000},null,"Uit_Transport_Doorzet_m3"]
[null,"Doorzet",null,{"$f":"Uit_Transport_Doorzet_ton","v":3534.4187999999999},null,"Uit_Transport_Doorzet_ton"]
[]
[null,"Laadvermogen",null,{"$f":"IF(Transport_Laadvermogen_Dim=\"ton\",Transport_Laadvermogen_ton,Transport_Laadvermogen_ton*Transport_RHO/1000)","v":25},"ton","Uit_Transport_Laadvermogen_ton"]
[null,"Dichtheid",null,{"$f":"Transport_RHO","v":353.44188000000003},"kg/m3","Transport_RHO"]
[null,null,null,{"$f":"Uit_Transport_Laadvermogen_ton/Transport_RHO*1000","v":70.732987273607762},null,"Uit_Transport_Laadvermogen_m3"]
[null,"Belading heen",null,{"$f":"Transport_Belading_Heen","v":100},"%"]
[null,"Snelheid",null,{"$f":"Transport_Snelheid_km_uur","v":55},"km/uur"]
[]
[null,"Aantal transporten",null,{"$f":"Uit_Transport_Doorzet_ton/Transport_Laadvermogen_ton/Transport_Belading_Heen*100","v":141.37675200000001},"-","Waarde"]
[null,null,null,{"$f":"INT(Uit_Transport_Doorzet_ton/Transport_Laadvermogen_ton/Transport_Belading_Heen*100)","v":141},"-","Afgerond"]
[null,"Aantal transporten",null,{"$f":"IF((D481-D482)>0.5,D482+1,D482)","v":141},"-","Uit_Transport_Transporten"]
[null,"Aantal kilometers",null,{"$f":"Uit_Transport_Transporten*Transport_Afstand+Uit_Transport_Transporten*Transport_Afstand*(100-Transport_Belading_Terug)/100","v":10575},"km","Uit_Transport_Kilometers"]
[null,"Transport tijd",null,{"$f":"Uit_Transport_Kilometers/Transport_Snelheid_km_uur","v":192.27272727272728},"uur","Uit_Transport_Verbrandingsmotor_Tijd_uur"]
[]
[null,"Tonkilometer",null,{"$f":"Uit_Transport_Doorzet_ton*Uit_Transport_Kilometers","v":37376478.810000002},"tonkm","Uit_Transport_TonKilometer_tonkm"]
[]
[]
[null,"Verbrandingsmotor"]
[]
[null,"Aandrijving Verbrandingsmotor",null,"Ja",null,"Transport_Verbrandingsmotor_Ja_Nee",null,null,null,null,"Ja"]
[null,"Verbrandingsmotor-ID",null,{"$f":"IF(Transport_Verbrandingsmotor_Ja_Nee=\"Ja\",1,0)","v":1},"-","Transport_Verbrandingsmotor_ID",null,null,null,null,1]
[null,"Brandstof",null,{"$f":"Transport_Verbrandingsmotor_Brandstof","v":"EU-Diesel"},null,"Transport_Verbrandingsmotor_Brandstof",null,null,null,null,"EU-Diesel"]
[null,"Brandstoffen-RHO",null,{"$f":"IF(Algemeen_Berekening_Methodiek_ID=\"EU\",LOOKUP(Transport_Verbrandingsmotor_Brandstof,Lijst_Brandstof_EU_Soort,Lijst_Brandstof_EU_RHO),\nIF(Algemeen_Berekening_Methodiek_ID=\"NL\",LOOKUP(Transport_Verbrandingsmotor_Brandstof,Lijst_Brandstof_NL_Soort,Lijst_Brandstof_NL_RHO),\nLOOKUP(Transport_Verbrandingsmotor_Brandstof,Lijst_Brandstof_NL_EU_Soort,Lijst_Brandstof_NL_EU_RHO)))","v":832},"kg/m3","Uit_Transport_Brandstof_RHO",null,null,null,null,832]
[null,"Brandstoffen-LHVv",null,{"$f":"IF(Transport_Verbrandingsmotor_Ja_Nee=\"Ja\",IF(Transport_Verbrandingsmotor_Brandstof=\"\",0,LOOKUP(Transport_Verbrandingsmotor_Brandstof,Lijst_Fossiel_Soort,Lijst_Fossiel_LHV_GJ_m3)),0)","v":35.512999999999998},"GJ/m3","Uit_Transport_Brandstof_LHVv",null,null,null,null,35.512999999999998]
[null,"Brandstoffen-LHVm",null,{"$f":"IF(Transport_Verbrandingsmotor_Ja_Nee=\"Ja\",IF(Transport_Verbrandingsmotor_Brandstof=\"\",0,LOOKUP(Transport_Verbrandingsmotor_Brandstof,Lijst_Fossiel_Soort,Lijst_Fossiel_LHV_MJ_kg)),0)","v":41.78},"MJ/kg","Uit_Transport_Brandstof_LHVm",null,null,null,null,41.78]
[null,"Maschinetijd",null,{"$f":"Uit_Transport_Verbrandingsmotor_Tijd_uur","v":192.27272727272728},"uur","Uit_Transport_Verbrandingsmotor_Tijd_uur",null,null,null,null,2138.181818181818]
[null,"Brandstofverbruik",null,{"$f":"IF(Transport_Verbrandingsmotor_ID=1,Transport_Verbrandingsmotor_Verbruik,0)","v":30},{"$f":"IF(Transport_Verbrandingsmotor_Ja_Nee=\"Ja\",Transport_Verbrandingsmotor_Verbruik_Dim,0)","v":"liter/100km"},null,null,null,null,null,30]
[]
[null,"Brandstofverbruik",null,{"$f":"IF(Transport_Verbrandingsmotor_Ja_Nee=\"Nee\",0,\nIF(Transport_Verbrandingsmotor_Verbruik_Dim=\"liter\",Transport_Verbrandingsmotor_Verbruik,\nIF(Transport_Verbrandingsmotor_Verbruik_Dim=\"liter/km\",Transport_Verbrandingsmotor_Verbruik*Uit_Transport_Kilometers,\nIF(Transport_Verbrandingsmotor_Verbruik_Dim=\"liter/100km\",Transport_Verbrandingsmotor_Verbruik*Uit_Transport_Kilometers/100,\nIF(Transport_Verbrandingsmotor_Verbruik_Dim=\"kg\",Transport_Verbrandingsmotor_Verbruik/Uit_Transport_Brandstof_RHO*1000,\nIF(Transport_Verbrandingsmotor_Verbruik_Dim=\"kg/km\",Transport_Verbrandingsmotor_Verbruik/Uit_Transport_Brandstof_RHO*1000*Uit_Transport_Kilometers,\nIF(Transport_Verbrandingsmotor_Verbruik_Dim=\"kg/100km\",Transport_Verbrandingsmotor_Verbruik/Uit_Transport_Brandstof_RHO*1000*Uit_Transport_Kilometers/100,)))))))","v":3172.5},"liter","Uit_Transport_Verbrandingsmotor_Verbruik_liter",null,null,null,null,35280,null,null,null,"liter"]
[null,"Brandstofverbruik",null,{"$f":"IF(Transport_Verbrandingsmotor_Ja_Nee=\"Nee\",0,\nIF(Uit_Transport_Kilometers=0,0,Uit_Transport_Verbrandingsmotor_Verbruik_liter/Uit_Transport_Kilometers))","v":0.3},"liter/km","Uit_Transport_Verbrandingsmotor_Verbruik_liter_km",null,null,null,null,0.3,null,null,null,"liter/km"]
[null,"Brandstofverbruik",null,{"$f":"IF(Transport_Verbrandingsmotor_Ja_Nee=\"Nee\",0,\nIF(Uit_Transport_Kilometers=0,0,Uit_Transport_Verbrandingsmotor_Verbruik_liter/Uit_Transport_Kilometers*100))","v":30},"liter/100km","Uit_Transport_Verbrandingsmotor_Verbruik_liter_100km",null,null,null,null,30,null,null,null,"liter/100km"]
[null,"Brandstofverbruik",null,{"$f":"IF(Transport_Verbrandingsmotor_Ja_Nee=\"Nee\",0,Uit_Transport_Verbrandingsmotor_Verbruik_liter*Uit_Transport_Brandstof_RHO/1000)","v":2639.52},"kg","Uit_Transport_Verbrandingsmotor_Verbruik_kg",null,null,null,null,29352.959999999999,null,null,null,"kg"]
[null,"Brandstofverbruik",null,{"$f":"IF(Transport_Verbrandingsmotor_Ja_Nee=\"Nee\",0,\nIF(Uit_Transport_Kilometers=0,0,Uit_Transport_Verbrandingsmotor_Verbruik_kg/Uit_Transport_Kilometers))","v":0.24959999999999999},"kg/km","Uit_Transport_Verbrandingsmotor_Verbruik_kg_km",null,null,null,null,0.24959999999999999,null,null,null,"kg/km"]
[null,"Brandstofverbruik",null,{"$f":"IF(Transport_Verbrandingsmotor_Ja_Nee=\"Nee\",0,\nIF(Uit_Transport_Kilometers=0,0,Uit_Transport_Verbrandingsmotor_Verbruik_kg/Uit_Transport_Kilometers*100))","v":24.959999999999997},"kg/100km","Uit_Transport_Verbrandingsmotor_Verbruik_kg_100km",null,null,null,null,24.959999999999997,null,null,null,"kg/100km"]
[]
[]
[null,"Brandstofverbruik",null,{"$f":"IF(Transport_Verbrandingsmotor_Ja_Nee=\"Nee\",0,Uit_Transport_Verbrandingsmotor_Verbruik_kg*Uit_Transport_Brandstof_LHVm)","v":110279.1456},"MJ","Uit_Transport_Verbrandingsmotor_Verbruik_MJ",null,null,null,null,1226366.6688000001]
[null,"Methode",null,{"$f":"Algemeen_Berekening_Methodiek_ID","v":"EU"},"-","Algemeen_Berekening_Methodiek_ID",null,null,null,null,"EU"]
[null,"CO2",null,{"$f":"IF(Transport_Verbrandingsmotor_Ja_Nee=\"Nee\",0,\nIF(Algemeen_Berekening_Methodiek_ID=\"EU\",LOOKUP(Transport_Verbrandingsmotor_Brandstof,Lijst_Brandstof_EU_Soort,Lijst_Brandstof_EU_CO2),\nIF(Algemeen_Berekening_Methodiek_ID=\"NL\",LOOKUP(Transport_Verbrandingsmotor_Brandstof,Lijst_Brandstof_NL_Soort,Lijst_Brandstof_NL_CO2),\nLOOKUP(Transport_Verbrandingsmotor_Brandstof,Lijst_Brandstof_NL_EU_Soort,Lijst_Brandstof_NL_EU_CO2))))","v":93.947222222222209},null,"Uit_Transport_Verbrandingsmotor_Emissie_CO2",null,null,null,null,93.947222222222209]
[null,"CH4",null,{"$f":"IF(Transport_Verbrandingsmotor_Ja_Nee=\"Nee\",0,\nIF(Algemeen_Berekening_Methodiek_ID=\"EU\",LOOKUP(Transport_Verbrandingsmotor_Brandstof,Lijst_Brandstof_EU_Soort,Lijst_Brandstof_EU_CH4),\nIF(Algemeen_Berekening_Methodiek_ID=\"NL\",LOOKUP(Transport_Verbrandingsmotor_Brandstof,Lijst_Brandstof_NL_Soort,Lijst_Brandstof_NL_CH4),\nLOOKUP(Transport_Verbrandingsmotor_Brandstof,Lijst_Brandstof_NL_EU_Soort,Lijst_Brandstof_NL_EU_CH4))))","v":0},null,"Uit_Transport_Verbrandingsmotor_Emissie_CH4",null,null,null,null,0]
[null,"N2O",null,{"$f":"IF(Transport_Verbrandingsmotor_Ja_Nee=\"Nee\",0,\nIF(Algemeen_Berekening_Methodiek_ID=\"EU\",LOOKUP(Transport_Verbrandingsmotor_Brandstof,Lijst_Brandstof_EU_Soort,Lijst_Brandstof_EU_N2O),\nIF(Algemeen_Berekening_Methodiek_ID=\"NL\",LOOKUP(Transport_Verbrandingsmotor_Brandstof,Lijst_Brandstof_NL_Soort,Lijst_Brandstof_NL_N2O),\nLOOKUP(Transport_Verbrandingsmotor_Brandstof,Lijst_Brandstof_NL_EU_Soort,Lijst_Brandstof_NL_EU_N2O))))","v":0},null,"Uit_Transport_Verbrandingsmotor_Emissie_N2O",null,null,null,null,0]
[null,"CO2 - equivalent",null,{"$f":"Uit_Transport_Verbrandingsmotor_Emissie_CO2*JRC_GWP_CO2\n+Uit_Transport_Verbrandingsmotor_Emissie_CH4*JRC_GWP_CH4\n+Uit_Transport_Verbrandingsmotor_Emissie_N2O*JRC_GWP_N2O","v":93.947222222222209},"kg/GJ","Uit_Transport_Verbrandingsmotor_Emissie_CO2eq",null,null,null,null,93.947222222222209]
[]
[null,"Doorzet invoer",null,{"$f":"Uit_Proces_Doorzet_GJ","v":34107.14142},"GJ","Uit_Hout_Doorzet_GJ",null,null,null,null,94570]
[null,"Doorzet uitvoer",null,{"$f":"Uit_Transport_Doorzet_GJ","v":34107.14142},"GJ","Uit_Transport_Doorzet_GJ",null,null,null,null,94570]
[null,"Doorzet invoer",null,{"$f":"Uit_Proces_Doorzet_tonds","v":1767.2094},"tonds","Uit_Hout_Doorzet_tonds",null,null,null,null,4900]
[null,"Doorzet uitvoer",null,{"$f":"Uit_Transport_Doorzet_tonds","v":1767.2094},"tonds","Uit_Transport_Doorzet_tonds",null,null,null,null,4900]
[null,"CO2/Doorzet",null,{"$f":"IF(Transport_Verbrandingsmotor_Ja_Nee=\"Nee\",0,\nIF(Uit_Transport_Invoer_Uitvoer_Dim=\"Invoer\",\nIF(Uit_Proces_Doorzet_MJ=0,0,Uit_Transport_Verbrandingsmotor_CO2T_g/Uit_Proces_Doorzet_MJ),\nIF(Uit_Transport_Doorzet_MJ=0,0,Uit_Transport_Verbrandingsmotor_CO2T_g/Uit_Transport_Doorzet_MJ)))","v":0.30376100038934306},"gCO2eq/MJ","Uit_Transport_Verbrandingsmotor_CO2T_g_MJ",null,null,null,null,1.2182905991295336,null,null,"gCO2eq/MJ"]
[null,"CO2/tkm",null,{"$f":"IF(Transport_Verbrandingsmotor_Ja_Nee=\"Nee\",0,\nIF(Uit_Transport_TonKilometer_tonkm=0,0,Uit_Transport_Verbrandingsmotor_CO2T_g/Uit_Transport_TonKilometer_tonkm))","v":0.27719088924417595},"gCO2eq/tkm","Uit_Transport_Verbrandingsmotor_CO2T_g_tkm",null,null,null,null,9.9970274503401346E-2,null,null,"gCO2eq/tkm"]
[null,"CO2 Verbrandingsmotor",null,{"$f":"IF(Transport_Verbrandingsmotor_Ja_Nee=\"Nee\",0,\nUit_Transport_Verbrandingsmotor_Verbruik_MJ*Uit_Transport_Verbrandingsmotor_Emissie_CO2eq)","v":10360419.398159999},"gCO2eq","Uit_Transport_Verbrandingsmotor_CO2T_g",null,null,null,null,115213741.95967999]
[null,"CO2",null,{"$f":"IF(Transport_Verbrandingsmotor_Ja_Nee=\"Nee\",0,\nUit_Transport_Verbrandingsmotor_CO2T_g/1000)","v":10360.41939816},"kgCO2eq","Uit_Transport_Verbrandingsmotor_CO2T_kg",null,null,null,null,115213.74195967999,null,null,"kg CO2eq"]
[null,"CO2/Doorzet",null,{"$f":"IF(Transport_Verbrandingsmotor_Ja_Nee=\"Nee\",0,\nIF(Uit_Proces_Invoer_Uitvoer_Dim=\"Invoer\",\nIF(Uit_Proces_Doorzet_MJ=0,0,Uit_Transport_Verbrandingsmotor_CO2T_kg/Uit_Proces_Doorzet_tonds),\nIF(Uit_Transport_Doorzet_MJ=0,0,Uit_Transport_Verbrandingsmotor_CO2T_kg/Uit_Transport_Doorzet_tonds)))","v":5.862587307514322},"gCO2eq/tonds","Uit_Transport_Verbrandingsmotor_CO2T_kg_tonds",null,null,null,null,23.513008563199996,null,null,"kgCO2eq/tonds"]
[null,"CO2",null,{"$f":"IF(Transport_Verbrandingsmotor_Ja_Nee=\"Nee\",0,\nUit_Transport_Verbrandingsmotor_CO2T_kg/1000)","v":10.360419398159999},"tonCO2eq","Uit_Transport_Verbrandingsmotor_CO2T_ton",null,null,null,null,115.21374195967999,null,null,"tonCO2eq"]
[null,"CO2",null,{"$f":"IF(Transport_Verbrandingsmotor_Ja_Nee=\"Nee\",0,Uit_Transport_Verbrandingsmotor_CO2T_ton/1000)","v":1.0360419398159999E-2},"MtonCO2eq","Uit_Transport_Verbrandingsmotor_CO2T_Mton",null,null,null,null,0.11521374195968,null,null,"MtonCO2eq"]
[]
[null,null,null,{"$f":"Uit_Transport_Verbrandingsmotor_CO2_Dim","v":"gCO2eq/MJ"},null,"Uit_Transport_Verbrandingsmotor_CO2_Dim",null,null,null,null,"gCO2eq/tkm"]
[null,"CO2_Verbrandingsmotor",null,{"$f":"IF(Transport_Verbrandingsmotor_Ja_Nee=\"Nee\",0,\nIF(Uit_Transport_Verbrandingsmotor_CO2_Dim=\"gCO2eq/MJ\",Uit_Transport_Verbrandingsmotor_CO2T_g_MJ,\nIF(Uit_Transport_Verbrandingsmotor_CO2_Dim=\"gCO2eq/tkm\",Uit_Transport_Verbrandingsmotor_CO2T_g_tkm,\nIF(Uit_Transport_Verbrandingsmotor_CO2_Dim=\"kgCO2eq\",Uit_Transport_Verbrandingsmotor_CO2T_kg,\nIF(Uit_Transport_Verbrandingsmotor_CO2_Dim=\"kgCO2eq/tonds\",Uit_Transport_Verbrandingsmotor_CO2T_kg_tonds,\nIF(Uit_Transport_Verbrandingsmotor_CO2_Dim=\"tonCO2eq\",Uit_Transport_Verbrandingsmotor_CO2T_ton,\nIF(Uit_Transport_Verbrandingsmotor_CO2_Dim=\"MtonCO2eq\",Uit_Transport_Verbrandingsmotor_CO2T_Mton,0)))))))","v":0.30376100038934306},null,"Uit_Transport_Brandstof_CO2",null,null,null,null,9.9970274503401346E-2]
[]
[]
[null,"Elektriciteit"]
[null,"Aandrijving elektromotor",null,"Nee",null,"Transport_Elektromotor_Ja_Nee"]
[null,"Vermogen of Verbruik",null,"Vermogen",null,"Transport_Elektromotor_Vermogen_Verbruik"]
[null,"Maschinetijd",null,{"$f":"IF(Transport_Elektromotor_Ja_Nee=\"Nee\",0,Uit_Transport_Verbrandingsmotor_Tijd_uur)","v":0},"uur","Uit_Transport_Elektromotor_Tijd_uur"]
[null,"Vermogen",null,{"$f":"IF(Transport_Elektromotor_Ja_Nee=\"Ja\",\nIF(Transport_Elektromotor_VermogenVerbruik_Dim=\"W\",Transport_Elektromotor_VermogenVerbruik/1000,\nIF(Transport_Elektromotor_VermogenVerbruik_Dim=\"kW\",Transport_Elektromotor_VermogenVerbruik,\nIF(Transport_Elektromotor_VermogenVerbruik_Dim=\"MW\",Transport_Elektromotor_VermogenVerbruik*1000,0))),0)","v":0},"kW","Uit_Transport_Elektromotor_Vermogen_kW"]
[null,"Stroomverbruik",null,{"$f":"IF(Transport_Elektromotor_Ja_Nee=\"Nee\",0,\nIF(Transport_Elektromotor_Vermogen_Verbruik=\"Vermogen\",Uit_Transport_Elektromotor_Vermogen_kW*Transport_Elektromotor_Loadfactor/100*Uit_Transport_Verbrandingsmotor_Tijd_uur,Transport_Elektromotor_VermogenVerbruik))","v":0},"kWh","Uit_Transport_Elektromotor_Verbruik_kWh"]
[null,"Stroomverbruik",null,{"$f":"IF(Transport_Elektromotor_Ja_Nee=\"Nee\",0,Uit_Transport_Elektromotor_Verbruik_kWh/1000)","v":0},"MWh","Uit_Transport_Elektromotor_Verbruik_MWh"]
[null,"Stroomverbruik",null,{"$f":"IF(Transport_Elektromotor_Ja_Nee=\"Nee\",0,Uit_Transport_Elektromotor_Verbruik_MWh*3.6)","v":0},"GJ","Uit_Transport_Elektromotor_Verbruik_GJ"]
[]
[null,"CO2",null,{"$f":"IF(Transport_Elektromotor_Ja_Nee=\"Nee\",0,\nIF(Algemeen_Berekening_Methodiek_ID=\"EU\",LOOKUP(Transport_Elektromotor_Stroombron,Lijst_Elektriciteit_EU_Soort,Lijst_Elektriciteit_EU_CO2),\nIF(Algemeen_Berekening_Methodiek_ID=\"NL\",LOOKUP(Transport_Elektromotor_Stroombron,Lijst_Elektriciteit_NL_Soort,Lijst_Elektriciteit_NL_CO2),\nLOOKUP(Transport_Elektromotor_Stroombron,Lijst_Elektriciteit_NL_EU_Soort,Lijst_Elektriciteit_NL_EU_CO2))))","v":0},"g/MJ","Uit_Transport_Elektromotor_Emissie_CO2"]
[null,"CH4",null,{"$f":"IF(Transport_Elektromotor_Ja_Nee=\"Nee\",0,\nIF(Algemeen_Berekening_Methodiek_ID=\"EU\",LOOKUP(Transport_Elektromotor_Stroombron,Lijst_Elektriciteit_EU_Soort,Lijst_Elektriciteit_EU_CH4),\nIF(Algemeen_Berekening_Methodiek_ID=\"NL\",LOOKUP(Transport_Elektromotor_Stroombron,Lijst_Elektriciteit_EU_Soort,Lijst_Elektriciteit_NL_CH4),\nLOOKUP(Transport_Elektromotor_Stroombron,Lijst_Elektriciteit_NL_EU_Soort,Lijst_Elektriciteit_NL_EU_CH4))))","v":0},"g/MJ","Uit_Transport_Elektromotor_Emissie_CH4"]
[null,"N2O",null,{"$f":"IF(Transport_Elektromotor_Ja_Nee=\"Nee\",0,\nIF(Algemeen_Berekening_Methodiek_ID=\"EU\",LOOKUP(Transport_Elektromotor_Stroombron,Lijst_Elektriciteit_EU_Soort,Lijst_Elektriciteit_EU_N2O),\nIF(Algemeen_Berekening_Methodiek_ID=\"NL\",LOOKUP(Transport_Elektromotor_Stroombron,Lijst_Elektriciteit_EU_Soort,Lijst_Elektriciteit_NL_N2O),\nLOOKUP(Transport_Elektromotor_Stroombron,Lijst_Elektriciteit_NL_EU_Soort,Lijst_Elektriciteit_NL_EU_N2O))))","v":0},"g/MJ","Uit_Transport_Elektromotor_Emissie_N2O"]
[null,"CO2 - equivalent",null,{"$f":"Uit_Transport_Elektromotor_Emissie_CO2*JRC_GWP_CO2\n+Uit_Transport_Verbrandingsmotor_Emissie_CH4*JRC_GWP_CH4\n+Uit_Transport_Verbrandingsmotor_Emissie_N2O*JRC_GWP_N2O","v":0},"g/MJ","Uit_Transport_Elektromotor_Emissie_CO2"]
[]
[null,"Doorzet invoer",null,{"$f":"Uit_Proces_Doorzet_GJ","v":34107.14142},"GJ",null,"Uit_Hout_Doorzet_GJ"]
[null,"Doorzet uitvoer",null,{"$f":"Uit_Transport_Doorzet_GJ","v":34107.14142},"GJ",null,"Uit_Transport_Doorzet_GJ"]
[null,"Doorzet invoer",null,{"$f":"Uit_Proces_Doorzet_tonds","v":1767.2094},"tonds",null,"Uit_Hout_Doorzet_tonds"]
[null,"Doorzet uitvoer",null,{"$f":"Uit_Transport_Doorzet_tonds","v":1767.2094},"tonds",null,"Uit_Transport_Doorzet_tonds"]
[null,"Tonkilometer",null,{"$f":"Uit_Transport_TonKilometer_tonkm","v":37376478.810000002},"tkm",null,"Uit_Transport_TonKilometer_tonkm"]
[null,"Invoer / uitvoer?",null,{"$f":"Uit_Transport_Invoer_Uitvoer_Dim","v":"Uitvoer"},null,null,"Uit_Transport_Invoer_Uitvoer_Dim"]
[null,"CO2/Doorzet",null,{"$f":"IF(Transport_Elektromotor_Ja_Nee=\"Nee\",0,\nIF(Uit_Transport_Invoer_Uitvoer_Dim=\"Invoer\",\nIF(Uit_Proces_Doorzet_GJ=0,0,Uit_Transport_Elektromotor_CO2T_kg/Uit_Proces_Doorzet_GJ),\nIF(Uit_Transport_Doorzet_GJ=0,0,Uit_Transport_Elektromotor_CO2T_kg/Uit_Transport_Doorzet_GJ)))","v":0},"gCO2eq/MJ",null,"Uit_Transport_Elektromotor_CO2T_g_MJ",null,null,null,null,null,null,"gCO2eq/MJ"]
[null,"CO2/tkm",null,{"$f":"IF(Transport_Elektromotor_Ja_Nee=\"Nee\",0,\nIF(Uit_Transport_TonKilometer_tonkm=0,0,Uit_Transport_Elektromotor_CO2T_g/Uit_Transport_TonKilometer_tonkm))","v":0},"gCO2eq/tkm",null,"Uit_Transport_Verbrandingsmotor_CO2T_g_tkm",null,null,null,null,null,null,"gCO2eq/tkm"]
[null,"CO2 Elektromotor",null,{"$f":"IF(Transport_Elektromotor_Ja_Nee=\"Nee\",0,\nUit_Transport_Elektromotor_Verbruik_GJ*1000*Uit_Transport_Elektromotor_Emissie_CO2eq)","v":0},"gCO2eq ",null,"Uit_Transport_Elektromotor_CO2T_g"]
[null,"CO2 Elektromotor",null,{"$f":"IF(Transport_Verbrandingsmotor_Ja_Nee=\"Nee\",0,\nUit_Transport_Elektromotor_CO2T_g/1000)","v":0},"kgCO2eq ",null,"Uit_Transport_Elektromotor_CO2T_kg",null,null,null,null,null,null,"kg CO2eq"]
[null,"CO2 Elektromotor",null,{"$f":"IF(Transport_Elektromotor_Ja_Nee=\"Nee\",0,\nIF(Uit_Transport_Doorzet_tonds=0,0,Uit_Transport_Elektromotor_CO2T_kg/Uit_Transport_Doorzet_tonds))","v":0},"kgCO2eq/tonds",null,"Uit_Transport_Elektromotor_CO2T_kg_tonds",null,null,null,null,null,null,"kgCO2eq/tonds"]
[null,"CO2 Elektromotor",null,{"$f":"IF(Transport_Verbrandingsmotor_Ja_Nee=\"Nee\",0,\nUit_Transport_Elektromotor_CO2T_kg/1000)","v":0},"tonCO2eq ",null,"Uit_Transport_Elektromotor_CO2T_ton",null,null,null,null,null,null,"tonCO2eq"]
[null,"CO2 Elektromotor",null,{"$f":"IF(Transport_Verbrandingsmotor_Ja_Nee=\"Nee\",0,\nUit_Transport_Elektromotor_CO2T_ton/1000)","v":0},"MtonCO2eq ",null,"Uit_Transport_Elektromotor_CO2T_Mton",null,null,null,null,null,null,"MtonCO2eq"]
[]
[]
[null,null,null,{"$f":"Uit_Transport_Verbrandingsmotor_CO2_Dim","v":"gCO2eq/MJ"},null,"Uit_Transport_Verbrandingsmotor_CO2_Dim"]
[null,"CO2_Elektromotor",null,{"$f":"IF(Transport_Elektromotor_Ja_Nee=\"Nee\",0,\nIF(Uit_Transport_Verbrandingsmotor_CO2_Dim=\"gCO2eq/MJ\",Uit_Transport_Elektromotor_CO2T_g_MJ,\nIF(Uit_Transport_Verbrandingsmotor_CO2_Dim=\"gCO2eq/tkm\",Uit_Transport_Elektromotor_CO2T_g_tkm,\nIF(Uit_Transport_Verbrandingsmotor_CO2_Dim=\"kgCO2eq\",Uit_Transport_Elektromotor_CO2T_kg,\nIF(Uit_Transport_Verbrandingsmotor_CO2_Dim=\"kgCO2eq/tonds\",Uit_Transport_Elektromotor_CO2T_kg_tonds,\nIF(Uit_Transport_Verbrandingsmotor_CO2_Dim=\"tonCO2eq\",Uit_Transport_Elektromotor_CO2T_ton,\nIF(Uit_Transport_Verbrandingsmotor_CO2_Dim=\"MtonCO2eq\",Uit_Transport_Elektromotor_CO2T_Mton,0)))))))","v":0},null,"Uit_Transport_Stroom_CO2"]
[]
[null,"Basis CO2"]
[null,"Invoer / uitvoer?",null,{"$f":"Uit_Transport_Invoer_Uitvoer_Dim","v":"Uitvoer"},null,"Uit_Transport_Invoer_Uitvoer_Dim"]
[null,null,null,{"$f":"Transport_CO2_Productie_Basis_Dim","v":"gCO2eq/tkm"}]
[null,null,null,{"$f":"Transport_CO2_Productie_Basis","v":0},{"$f":"Transport_CO2_Productie_Basis_Dim","v":"gCO2eq/tkm"},"Transport_CO2_Productie_Basis"]
[null,null,null,{"$f":"IF(Uit_Transport_Invoer_Uitvoer_Dim=\"Invoer\",\nIF(Uit_Proces_Doorzet_MJ=0,0,Uit_Transport_Basis_CO2T_g/Uit_Proces_Doorzet_MJ),\nIF(Uit_Transport_Doorzet_MJ=0,0,Uit_Transport_Basis_CO2T_g/Uit_Transport_Doorzet_MJ))","v":0},"gCO2eq/MJ","Uit_Transport_Basis_CO2T_g_MJ",null,null,null,"gCO2eq/MJ"]
[null,null,null,{"$f":"IF(Uit_Transport_TonKilometer_tonkm=0,0,Uit_Transport_Basis_CO2T_g/Uit_Transport_TonKilometer_tonkm)","v":0},"gCO2eq/tkm",null,null,null,null,"gCO2eq/tkm"]
[null,null,null,{"$f":"IF(Uit_Transport_Invoer_Uitvoer_Dim=\"Invoer\",\nIF(Transport_CO2_Productie_Basis_Dim=\"gCO2eq/MJ\",Transport_CO2_Productie_Basis*Uit_Proces_Doorzet_MJ,\nIF(Transport_CO2_Productie_Basis_Dim=\"gCO2eq/tkm\",Transport_CO2_Productie_Basis*Uit_Transport_TonKilometer_tonkm,\nIF(Transport_CO2_Productie_Basis_Dim=\"gCO2eq\",Transport_CO2_Productie_Basis,\nIF(Transport_CO2_Productie_Basis_Dim=\"kgCO2eq\",Transport_CO2_Productie_Basis*1000,\nIF(Transport_CO2_Productie_Basis_Dim=\"kgCO2eq/tonds\",Transport_CO2_Productie_Basis*1000*Uit_Proces_Doorzet_tonds,\nIF(Transport_CO2_Productie_Basis_Dim=\"tonCO2eq\",Transport_CO2_Productie_Basis/1000/1000,\nIF(Transport_CO2_Productie_Basis_Dim=\"MtonCO2eq\",Transport_CO2_Productie_Basis/1000/1000/1000,0))))))),\nIF(Transport_CO2_Productie_Basis_Dim=\"gCO2eq/MJ\",Transport_CO2_Productie_Basis*Uit_Transport_Doorzet_MJ,\nIF(Transport_CO2_Productie_Basis_Dim=\"gCO2eq/tkm\",Transport_CO2_Productie_Basis*Uit_Transport_TonKilometer_tonkm,\nIF(Transport_CO2_Productie_Basis_Dim=\"gCO2eq\",Transport_CO2_Productie_Basis,\nIF(Transport_CO2_Productie_Basis_Dim=\"kgCO2eq\",Transport_CO2_Productie_Basis*1000,\nIF(Transport_CO2_Productie_Basis_Dim=\"kgCO2eq/tonds\",Transport_CO2_Productie_Basis*1000*Uit_Transport_Doorzet_tonds,\nIF(Transport_CO2_Productie_Basis_Dim=\"tonCO2eq\",Transport_CO2_Productie_Basis/1000/1000,\nIF(Transport_CO2_Productie_Basis_Dim=\"MtonCO2eq\",Transport_CO2_Productie_Basis/1000/1000/1000,0))))))))","v":0},"gCO2eq ","Uit_Transport_Basis_CO2T_g"]
[null,null,null,{"$f":"Uit_Transport_Basis_CO2T_g/1000","v":0},"kgCO2eq","Uit_Transport_Basis_CO2T_kg",null,null,null,"kg CO2eq"]
[null,null,null,{"$f":"IF(Uit_Transport_Invoer_Uitvoer_Dim=\"Invoer\",\nIF(Uit_Proces_Doorzet_tonds=0,0,Uit_Transport_Basis_CO2T_kg/Uit_Proces_Doorzet_tonds),\nIF(Uit_Transport_Doorzet_tonds=0,0,Uit_Transport_Basis_CO2T_kg/Uit_Transport_Doorzet_tonds))","v":0},"kgCO2eq/tonds","Uit_Transport_Basis_CO2T_kg_tonds",null,null,null,"kgCO2eq/tonds"]
[null,null,null,{"$f":"Uit_Transport_Basis_CO2T_kg/1000","v":0},"tonCO2eq","Uit_Transport_Basis_CO2T_ton",null,null,null,"tonCO2eq"]
[null,null,null,{"$f":"Uit_Transport_Basis_CO2T_ton/1000","v":0},"MtonCO2eq","Uit_Transport_Basis_CO2T_Mton",null,null,null,"MtonCO2eq"]
[]
[null,null,null,{"$f":"IF(Uit_Transport_Verbrandingsmotor_CO2_Dim=\"gCO2eq/MJ\",Uit_Transport_Basis_CO2T_g_MJ,\nIF(Uit_Transport_Verbrandingsmotor_CO2_Dim=\"gCO2eq/tkm\",Uit_Transport_Basis_CO2T_g_tkm,\nIF(Uit_Transport_Verbrandingsmotor_CO2_Dim=\"gCO2eq\",Uit_Transport_Basis_CO2T_g,\nIF(Uit_Transport_Verbrandingsmotor_CO2_Dim=\"kgCO2eq\",Uit_Transport_Basis_CO2T_kg,\nIF(Uit_Transport_Verbrandingsmotor_CO2_Dim=\"kgCO2eq/tonds\",Uit_Transport_Basis_CO2T_kg_tonds,\nIF(Uit_Transport_Verbrandingsmotor_CO2_Dim=\"tonCO2eq\",Uit_Transport_Basis_CO2T_ton,\nIF(Uit_Transport_Verbrandingsmotor_CO2_Dim=\"MtonCO2eq\",Uit_Transport_Basis_CO2T_Mton)))))))","v":0},{"$f":"Uit_Transport_Verbrandingsmotor_CO2_Dim","v":"gCO2eq/MJ"}]
[]
[null,"CO2 op invoer / uitvoer",null,{"$f":"Uit_Transport_Invoer_Uitvoer_Dim","v":"Uitvoer"}]
[null,"CO2 Verbrandingsmotor",null,{"$f":"IF(Uit_Transport_Brandstof_CO2=0,0,Uit_Transport_Brandstof_CO2)","v":0.30376100038934306},{"$f":"Uit_Transport_Verbrandingsmotor_CO2_Dim","v":"gCO2eq/MJ"}]
[null,"CO2 Elektromotor",null,{"$f":"IF(Uit_Transport_Stroom_CO2=0,0,Uit_Transport_Stroom_CO2)","v":0},{"$f":"Uit_Transport_Verbrandingsmotor_CO2_Dim","v":"gCO2eq/MJ"}]
[null,"CO2 Basis",null,{"$f":"IF(Uit_Transport_Basis_CO2=0,0,Uit_Transport_Basis_CO2)","v":0},{"$f":"Uit_Transport_Verbrandingsmotor_CO2_Dim","v":"gCO2eq/MJ"}]
[null,"CO2 Totaal",null,{"$f":"SUM(D579:D581)","v":0.30376100038934306},{"$f":"Uit_Transport_Verbrandingsmotor_CO2_Dim","v":"gCO2eq/MJ"},null,null,"Uit_Proces_CO2T"]
[]
[]
[null,"Samenvatting Transport",{"$f":"ROW()","v":585},null,null,null,null,null,null,null,null,null,null,null,{"$f":"B585","v":"Samenvatting Transport"}]
[]
[null,null,null,{"$f":"Samenvatting_Transport_Doorzet_Dim","v":"MJ"},null,"Samenvatting_Transport_Doorzet_Dim"]
[null,"Doorzet",null,{"$f":"IF(Samenvatting_Transport_Doorzet_Dim=\"ton\",Uit_Transport_Doorzet_ton,\nIF(Samenvatting_Transport_Doorzet_Dim=\"tonds\",Uit_Transport_Doorzet_tonds,\nIF(Samenvatting_Transport_Doorzet_Dim=\"tonkm\",Uit_Transport_TonKilometer_tonkm,\nIF(Samenvatting_Transport_Doorzet_Dim=\"km\",Uit_Transport_Kilometers,\nIF(Samenvatting_Transport_Doorzet_Dim=\"m3\",Uit_Transport_Doorzet_m3,\nIF(Samenvatting_Transport_Doorzet_Dim=\"MJ\",Uit_Transport_Doorzet_MJ,\nIF(Samenvatting_Transport_Doorzet_Dim=\"GJ\",Uit_Transport_Doorzet_GJ,\nIF(Samenvatting_Transport_Doorzet_Dim=\"kWh\",Uit_Transport_Doorzet_kWh,\nIF(Samenvatting_Transport_Doorzet_Dim=\"MWh\",Uit_Transport_Doorzet_MWh,)))))))))","v":34107141.420000002},null,"Samenvatting_Transport_Doorzet",null,null,null,null,null,null,null,"ton"]
[null,null,null,null,null,null,null,null,null,null,null,null,null,"tonds"]
[null,null,null,{"$f":"Uit_Transport_Verbrandingsmotor_CO2_Dim","v":"gCO2eq/MJ"},null,"Uit_Transport_Verbrandingsmotor_CO2_Dim",null,null,null,null,null,null,null,"tonkm"]
[null,null,null,{"$f":"Uit_Transport_CO2T","v":0.30376100038934306},null,null,null,null,null,null,null,null,null,"km"]
[null,"CO2 Totaal",null,{"$f":"IF(Uit_Transport_Invoer_Uitvoer_Dim=\"Invoer\",\nIF(Uit_Proces_Doorzet_MJ=0,0,Uit_Transport_CO2T_g/Uit_Proces_Doorzet_MJ),\nIF(Uit_Transport_Doorzet_MJ=0,0,Uit_Transport_CO2T_g/Uit_Transport_Doorzet_MJ))","v":0.30376100038934306},"gCO2eq/MJ",null,"Uit_Transport_CO2T_g_MJ",null,null,null,null,"gCO2eq/MJ",null,"m3"]
[null,"CO2 Totaal",null,{"$f":"IF(Uit_Transport_TonKilometer_tonkm=0,0,Uit_Transport_Basis_CO2T_g/Uit_Transport_TonKilometer_tonkm)","v":0},"gCO2eq/tkm",null,"Uit_Transport_CO2T_g_tonkm",null,null,null,null,"gCO2eq/tkm",null,"MJ"]
[null,"CO2 Totaal",null,{"$f":"IF(Uit_Transport_Invoer_Uitvoer_Dim=\"Invoer\",\nIF(Uit_Transport_Verbrandingsmotor_CO2_Dim=\"gCO2eq/MJ\",Uit_Transport_CO2T*Uit_Hout_Doorzet_MJ,\nIF(Uit_Transport_Verbrandingsmotor_CO2_Dim=\"gCO2eq/tkm\",Uit_Transport_CO2T*Uit_Transport_TonKilometer_tonkm,\nIF(Uit_Transport_Verbrandingsmotor_CO2_Dim=\"kgCO2eq/tonds\",Uit_Transport_CO2T*1000*Uit_Hout_Doorzet_tonds,\nIF(Uit_Transport_Verbrandingsmotor_CO2_Dim=\"kgCO2eq\",Uit_Transport_CO2T*1000,\nIF(Uit_Transport_Verbrandingsmotor_CO2_Dim=\"tonCO2eq\",Uit_Transport_CO2T/1000/1000,\nIF(Uit_Transport_Verbrandingsmotor_CO2_Dim=\"MtonCO2eq\",Uit_Transport_CO2T/1000/1000/1000)))))),\nIF(Uit_Transport_Verbrandingsmotor_CO2_Dim=\"gCO2eq/MJ\",Uit_Transport_CO2T*Uit_Transport_Doorzet_MJ,\nIF(Uit_Transport_Verbrandingsmotor_CO2_Dim=\"gCO2eq/tkm\",Uit_Transport_CO2T*Uit_Transport_TonKilometer_tonkm,\nIF(Uit_Transport_Verbrandingsmotor_CO2_Dim=\"kgCO2eq/tonds\",Uit_Transport_CO2T*1000*Uit_Transport_Doorzet_tonds,\nIF(Uit_Transport_Verbrandingsmotor_CO2_Dim=\"kgCO2eq\",Uit_Transport_CO2T*1000,\nIF(Uit_Transport_Verbrandingsmotor_CO2_Dim=\"tonCO2eq\",Uit_Transport_CO2T/1000/1000,\nIF(Uit_Transport_Verbrandingsmotor_CO2_Dim=\"MtonCO2eq\",Uit_Transport_CO2T/1000/1000/1000,0)))))))","v":10360419.398159999},"gCO2eq","Berekend","Uit_Transport_CO2T_g",null,null,null,null,null,null,"GJ"]
[null,"CO2 Totaal",null,{"$f":"Uit_Transport_CO2T_g/1000","v":10360.41939816},"kgCO2eq",null,"Uit_Transport_CO2T_kg",null,null,null,null,"kg CO2eq",null,"kWh"]
[null,"CO2 Totaal",null,{"$f":"IF(Uit_Transport_Invoer_Uitvoer_Dim=\"Invoer\",\nIF(Uit_Proces_Doorzet_MJ=0,0,Uit_Transport_CO2T_kg/Uit_Proces_Doorzet_tonds),\nIF(Uit_Transport_Doorzet_MJ=0,0,Uit_Transport_CO2T_kg/Uit_Transport_Doorzet_tonds))","v":5.862587307514322},"kgCO2eq/tonds",null,"Uit_Transport_CO2T_kg_tonds",null,null,null,null,"kgCO2eq/tonds",null,"MWh"]
[null,"CO2 Totaal",null,{"$f":"Uit_Transport_CO2T_kg/1000","v":10.360419398159999},"tonCO2eq",null,"Uit_Transport_CO2T_ton",null,null,null,null,"tonCO2eq"]
[null,"CO2 Totaal",null,{"$f":"Uit_Transport_CO2T_ton/1000","v":1.0360419398159999E-2},"MtonCO2eq",null,"Uit_Transport_CO2T_Mton",null,null,null,null,"MtonCO2eq"]
[]
[null,"CO2 productie Transport",null,{"$f":"Samenvatting_Transport_CO2T_Dim","v":"gCO2eq"},null,"Samenvatting_Transport_CO2_Dim"]
[null,null,null,{"$f":"IF(Samenvatting_Transport_CO2T_Dim=\"gCO2eq\",Uit_Transport_CO2T_g,\nIF(Samenvatting_Transport_CO2T_Dim=\"kgCO2eq\",Uit_Transport_CO2T_kg,\nIF(Samenvatting_Transport_CO2T_Dim=\"tonCO2eq\",Uit_Transport_CO2T_ton,\nIF(Samenvatting_Transport_CO2T_Dim=\"MtonCO2eq\",Uit_Transport_CO2T_Mton))))","v":10360419.398159999},null,"Samenvatting_Transport_CO2T"]
[]
[]
[null,"Drogen",{"$f":"ROW()","v":604}]
[]
[null,"Drogen - Hout - Eigenschappen",{"$f":"ROW()","v":606},null,null,null,null,null,null,null,"Na drogen",null,null,null,{"$f":"B606","v":"Drogen - Hout - Eigenschappen"}]
[null,"Houtsoort",null,{"$f":"Drogen_Hout_Soort","v":"Eiken"},"-","Drogen_Hout_Soort"]
[null,"Vochtigheid",null,{"$f":"Drogen_Hout_Vochtigheid","v":50},"%","Drogen_Hout_Vochtigheid",null,null,null,"Verandering vochtigheid",{"$f":"Drogen_Hout_Vochtigheid_Delta","v":-20},null,"Drogen_Hout_Vochtigheid_Delta"]
[null,"Vochtgehalte",null,{"$f":"Drogen_Hout_Vochtigheid/(100-Drogen_Hout_Vochtigheid)*100","v":100},"%","Uit_Drogen_Hout_Vochtgehalte",null,null,null,"Vochtigheid",{"$f":"Drogen_Hout_Vochtigheid+Drogen_Hout_Vochtigheid_Delta","v":30},null,"Drogen_Na_Hout_Vochtigheid"]
[]
[null,"RHO-0",null,{"$f":"LOOKUP(Drogen_Hout_Soort,Lijst_Hout_Soort,Lijst_Hout_RHO_Darr)","v":680},"kg/m3","Drogen_Hout_RHO_0",null,null,null,"RHO-0",{"$f":"Drogen_Hout_RHO_0","v":680},"kg/m3","Drogen_Na_Hout_RHO_0",null,null,{"$f":"Drogen_Hout_RHO_0-Drogen_Na_Hout_RHO_0","v":0}]
[null,"Krimp",null,{"$f":"LOOKUP(Drogen_Hout_Soort,Lijst_Hout_Soort,Lijst_Hout_Krimp)","v":13.9},"%","Drogen_Hout_Krimp",null,null,null,"Krimp",{"$f":"Drogen_Hout_Krimp","v":13.9},"%","Drogen_Na_Hout_Krimp",null,null,{"$f":"Drogen_Hout_Krimp-Drogen_Na_Hout_Krimp","v":0}]
[null,"Vezel verzadigingspunt",null,{"$f":"LOOKUP(Drogen_Hout_Soort,Lijst_Hout_Soort,Lijst_Hout_VVP)","v":23},"%","Drogen_Hout_Krimp_Hs",null,null,null,"Vezel verzadigingspunt",{"$f":"Drogen_Hout_Krimp_Hs","v":23},"%","Drogen_Na_Hout_Krimp_Hs",null,null,{"$f":"Drogen_Hout_Krimp_Hs-Drogen_Na_Hout_Krimp_Hs","v":0}]
[null,"RHO Volume Factor=1",null,{"$f":"IF(Drogen_Hout_Vochtigheid>Drogen_Hout_Krimp_Hs,Drogen_Hout_RHO_0*(1-Drogen_Hout_Krimp/100)/(1-Drogen_Hout_Vochtigheid/100),Drogen_Hout_RHO_0*(1-Drogen_Hout_Vochtigheid/Drogen_Hout_Krimp_Hs*Drogen_Hout_Krimp/100)/(1-Drogen_Hout_Vochtigheid/100))","v":1170.96},"m3","Drogen_Hout_RHO_VF1",null,null,null,"RHO Volume Factor=1",{"$f":"IF(Drogen_Na_Hout_Vochtigheid>Drogen_Na_Hout_Krimp_Hs,Drogen_Na_Hout_RHO_0*(1-Drogen_Na_Hout_Krimp/100)/(1-Drogen_Na_Hout_Vochtigheid/100),Drogen_Na_Hout_RHO_0*(1-Drogen_Na_Hout_Vochtigheid/Drogen_Na_Hout_Krimp_Hs*Drogen_Na_Hout_Krimp/100)/(1-Drogen_Na_Hout_Vochtigheid/100))","v":836.40000000000009},"m3","Drogen_Na_Hout_RHO_VF1",null,null,{"$f":"Drogen_Hout_RHO_VF1-Drogen_Na_Hout_RHO_VF1","v":334.55999999999995}]
[null,"Massa hout",null,{"$f":"Drogen_Hout_RHO_VF1*(1-Drogen_Hout_Vochtigheid/100)","v":585.48},"kg","Drogen_Hout_Massa",null,null,null,"Massa hout",{"$f":"Drogen_Na_Hout_RHO_VF1*(1-Drogen_Na_Hout_Vochtigheid/100)","v":585.48},"kg","Drogen_Na_Hout_Massa",null,null,{"$f":"Drogen_Hout_Massa-Drogen_Na_Hout_Massa","v":0}]
[null,"Massa water",null,{"$f":"Drogen_Hout_RHO_VF1*Drogen_Hout_Vochtigheid/100","v":585.48},"kg","Drogen_Hout_Water",null,null,null,"Massa water",{"$f":"Drogen_Na_Hout_RHO_VF1*Drogen_Na_Hout_Vochtigheid/100","v":250.92000000000004},"kg","Drogen_Na_Hout_Water",null,null,{"$f":"Drogen_Hout_Water-Drogen_Na_Hout_Water","v":334.55999999999995}]
[null,"Totale massa",null,{"$f":"Drogen_Hout_Massa+Drogen_Hout_Water","v":1170.96},"kg","Drogen_Hout_Massa_Water",null,null,null,"Totale massa",{"$f":"Drogen_Na_Hout_Massa+Drogen_Na_Hout_Water","v":836.40000000000009},"kg","Drogen_Na_Hout_Massa_Water",null,null,{"$f":"Drogen_Hout_Massa_Water-Drogen_Na_Hout_Massa_Water","v":334.55999999999995}]
[]
[null,"Volume soort",null,{"$f":"Drogen_Hout_Vorm","v":"Chips G30/P16"},"-","Drogen_Hout_Vorm",null,null,null,null,{"$f":"D619","v":"Chips G30/P16"}]
[null,"Volume Type Factor",null,{"$f":"LOOKUP(Drogen_Hout_Vorm,Lijst_Volume_Vorm,Lijst_Volume_Vorm_Factor)","v":0.4},"m3/m3","Drogen_Hout_Vorm_Vulling",null,null,null,null,{"$f":"Drogen_Hout_Vorm_Vulling","v":0.4},"m3/m3","Drogen_Na_Hout_Vorm_Vulling",null,null,{"$f":"Drogen_Hout_Vorm_Vulling-Drogen_Na_Hout_Vorm_Vulling","v":0}]
[null,"RHO bij Volume Factor",null,{"$f":"Drogen_Hout_RHO_VF1*Drogen_Hout_Vorm_Vulling","v":468.38400000000001},"kg/m3","Drogen_Hout_RHO",null,null,null,null,{"$f":"Drogen_Na_Hout_RHO_VF1*Drogen_Na_Hout_Vorm_Vulling","v":334.56000000000006},null,"Drogen_Na_Hout_RHO",null,null,{"$f":"Drogen_Hout_RHO-Drogen_Na_Hout_RHO","v":133.82399999999996}]
[null,"Asgehalte",null,{"$f":"LOOKUP(Hout_Vorm,Lijst_Volume_Vorm,Lijst_Hout_Asgehalte)","v":2},"%","Drogen_Hout_Asgehalte"]
[]
[null,"HHV-ds",null,{"$f":"LOOKUP(Hout_Soort,Lijst_Hout_Soort,Lijst_Hout_HHVds)","v":19.3},"GJ/ton","Drogen_Hout_HHVds",null,null,null,"HHV-ds",{"$f":"LOOKUP(Hout_Soort,Lijst_Hout_Soort,Lijst_Hout_HHVds)","v":19.3},"GJ/ton","Drogen_Na_Hout_HHVds",null,null,{"$f":"Drogen_Hout_HHVds-Drogen_Na_Hout_HHVds","v":0}]
[null,"H2",null,{"$f":"LOOKUP(Hout_Soort,Lijst_Hout_Soort,Lijst_Hout_H2)","v":6},"%","Drogen_Hout_H2",null,null,null,"H2",{"$f":"LOOKUP(Hout_Soort,Lijst_Hout_Soort,Lijst_Hout_H2)","v":6},"%","Drogen_Na_Hout_H2",null,null,{"$f":"Drogen_Hout_H2-Drogen_Na_Hout_H2","v":0}]
[null,"LHV-ds",null,{"$f":"Drogen_Hout_HHVds-Drogen_Hout_H2/(100*2)*18.02*2.447","v":17.977151800000001},"GJ/tonds","Drogen_Hout_LHVds",null,null,null,"LHV-ds",{"$f":"Drogen_Na_Hout_HHVds-Drogen_Na_Hout_H2/(100*2)*18.02*2.447","v":17.977151800000001},"GJ/tonds","Drogen_Na_Hout_LHVds",null,null,{"$f":"Drogen_Hout_LHVds-Drogen_Na_Hout_LHVds","v":0}]
[null,"LHV-Hm",null,{"$f":"Drogen_Hout_HHVds*(1-Drogen_Hout_Vochtigheid/100)-2.447*Drogen_Hout_Vochtigheid/100-Drogen_Hout_H2/(100*2)*18.02*2.447*(1-Drogen_Hout_Vochtigheid/100)","v":7.7650759000000011},"GJ/ton","Drogen_Hout_LHVm",null,null,null,"LHV-Hm",{"$f":"Drogen_Na_Hout_HHVds*(1-Drogen_Na_Hout_Vochtigheid/100)-2.447*Drogen_Na_Hout_Vochtigheid/100-Drogen_Na_Hout_H2/(100*2)*18.02*2.447*(1-Drogen_Na_Hout_Vochtigheid/100)","v":11.849906260000001},"GJ/ton","Drogen_Na_Hout_LHVm",null,null,{"$f":"Drogen_Hout_LHVm-Drogen_Na_Hout_LHVm","v":-4.0848303599999998}]
[null,"LHV-Hv",null,{"$f":"Drogen_Hout_LHVm*Drogen_Hout_RHO/1000","v":3.6370373103456011},"GJ/m3","Drogen_Hout_LHVv",null,null,null,"LHV-Hv",{"$f":"Drogen_Na_Hout_LHVm*Drogen_Na_Hout_RHO/1000","v":3.9645046383456011},"GJ/m3","Drogen_Na_Hout_LHVv",null,null,{"$f":"Drogen_Hout_LHVv-Drogen_Na_Hout_LHVv","v":-0.327467328}]
[]
[null,null,null,{"$f":"IF(Hout_LHVv_Dim=\"GJ/m3\",Hout_LHVv,Hout_LHVv/3.6)","v":0.86129145000000007},{"$f":"Hout_LHVv_Dim","v":"MWh/m3"},"Uit_Drogen_Hout_LHVv"]
[null,null,null,{"$f":"IF(Hout_LHVm_Dim=\"GJ/ton\",Hout_LHVm,\nIF(Hout_LHVm_Dim=\"MWh/ton\",Hout_LHVm/3.6,\nIF(Hout_LHVm_Dim=\"GJ/tonds\",Hout_LHVds,\nIF(Hout_LHVm_Dim=\"MWh/tonds\",Hout_LHVds/3.6,\"berekening LHVm\"))))","v":9.65},{"$f":"Hout_LHVm_Dim","v":"GJ/ton"},"Uit_Drogen_Hout_LHVm"]
[]
[null,"Drogen - Hout - Doorzet",{"$f":"ROW()","v":633},"Hout-IN",null,null,null,null,null,null,"Hout_UIT",null,null,null,{"$f":"B633","v":"Drogen - Hout - Doorzet"}]
[]
[null,"Doorzet",null,{"$f":"Drogen_Hout_Doorzet","v":100},null,"Drogen_Hout_Doorzet",null,null,null,null,"←De doorzet wordt in eerste instantie berekend voor GJ"]
[null,"Doorzet_Dim",null,{"$f":"Drogen_Hout_Doorzet_Dim","v":"tonds"},null,"Drogen_Hout_Doorzet_Dim",null,null,null,null,"Daaruit worden de andere dimensies berekend"]
[null,null,null,null,null,null,null,null,null,null,null,null,"Controle"]
[null,"Doorzet",null,{"$f":"Uit_Drogen_Hout_Doorzet_GJ/Hout_LHVv","v":10000},"m3","Uit_Drogen_Hout_Doorzet_m3",null,null,"m3",null,{"$f":"Uit_Drogen_Na_Hout_Doorzet_GJ/Drogen_Na_Hout_LHVv","v":7284.9618722982332},"m3",{"$f":"Uit_Drogen_Hout_Doorzet_m3*Hout_LHVv","v":31006.492200000001},{"$f":"Uit_Drogen_Na_Hout_Doorzet_m3*Drogen_Na_Hout_LHVv","v":28881.265132897199},{"$f":"Uit_Drogen_Na_Hout_Doorzet_m3*Drogen_Na_Hout_LHVv","v":28881.265132897199},null,null,"GJ"]
[null,"Doorzet",null,{"$f":"Uit_Drogen_Hout_Doorzet_GJ/Hout_LHVm*1000","v":3213107.9999999995},"kg","Uit_Drogen_Hout_Doorzet_kg",null,null,"kg",null,{"$f":"Uit_Drogen_Na_Hout_Doorzet_GJ/Drogen_Na_Hout_LHVm*1000","v":2437256.8439960973},"kg",{"$f":"Uit_Drogen_Hout_Doorzet_kg*Hout_LHVm/1000","v":31006.492199999997},{"$f":"Uit_Drogen_Na_Hout_Doorzet_kg*Hout_LHVm/1000","v":23519.528544562341},null,null,null,"GJ"]
[null,"Doorzet",null,{"$f":"Uit_Drogen_Hout_Doorzet_kg*(1-Hout_Vochtigheid/100)","v":1606553.9999999998},"kgds","Uit_Drogen_Hout_Doorzet_kgds",null,null,"kgds",null,{"$f":"Uit_Drogen_Na_Hout_Doorzet_kg*(1-Drogen_Na_Hout_Vochtigheid/100)","v":1706079.790797268},"kgds",{"$f":"Uit_Drogen_Hout_Doorzet_kgds/(1-Hout_Vochtigheid/100)*Hout_LHVm/1000","v":31006.492199999997},{"$f":"Uit_Drogen_Na_Hout_Doorzet_kgds/(1-Hout_Vochtigheid/100)*Hout_LHVm/1000","v":32927.339962387276},null,null,null,"GJ"]
[null,"Doorzet",null,{"$f":"Uit_Drogen_Hout_Doorzet_GJ/Hout_LHVm","v":3213.1079999999997},"ton","Uit_Drogen_Hout_Doorzet_ton",null,null,"ton",null,{"$f":"Uit_Drogen_Na_Hout_Doorzet_GJ/Drogen_Na_Hout_LHVm","v":2437.2568439960974},"ton",{"$f":"Uit_Drogen_Hout_Doorzet_ton*Hout_LHVm","v":31006.492199999997},{"$f":"Uit_Drogen_Na_Hout_Doorzet_ton*Hout_LHVm","v":23519.528544562341},null,null,null,"GJ"]
[null,"Doorzet",null,{"$f":"Uit_Drogen_Hout_Doorzet_ton*(1-Hout_Vochtigheid/100)","v":1606.5539999999999},"tonds","Uit_Drogen_Hout_Doorzet_tonds",null,null,"tonds",null,{"$f":"Uit_Drogen_Hout_Doorzet_tonds","v":1606.5539999999999},"tonds",{"$f":"Uit_Drogen_Hout_Doorzet_tonds*Drogen_Hout_LHVm/(1-Drogen_Hout_Vochtigheid/100)","v":24950.0274948972},{"$f":"Uit_Drogen_Na_Hout_Doorzet_tonds*Drogen_Na_Hout_LHVm/(1-Drogen_Na_Hout_Vochtigheid/100)","v":27196.449002325771},null,null,null,"GJ"]
[null,"Doorzet",null,{"$f":"Uit_Drogen_Hout_Doorzet_GJ*1000","v":31006492.199999999},"MJ","Uit_Drogen_Hout_Doorzet_MJ",null,null,"MJ",null,{"$f":"Uit_Drogen_Na_Hout_Doorzet_GJ*1000","v":28881265.132897198},"MJ",{"$f":"Uit_Drogen_Hout_Doorzet_MJ/1000","v":31006.492200000001},{"$f":"Uit_Drogen_Na_Hout_Doorzet_GJ","v":28881.265132897199},null,null,null,"GJ"]
[null,"Doorzet",null,{"$f":"IF(Hout_Doorzet_Dim=\"m3\",Hout_Doorzet_Oogst_Eindgebruiker*Hout_LHVv,\nIF(Hout_Doorzet_Dim=\"kg\",Hout_Doorzet_Oogst_Eindgebruiker*Hout_LHVm/1000,\nIF(Hout_Doorzet_Dim=\"kgds\",Hout_Doorzet_Oogst_Eindgebruiker/(1-Hout_Vochtigheid/100)*Hout_LHVm/1000,\nIF(Hout_Doorzet_Dim=\"ton\",Hout_Doorzet_Oogst_Eindgebruiker*Hout_LHVm,\nIF(Hout_Doorzet_Dim=\"tonds\",Hout_Doorzet_Oogst_Eindgebruiker/(1-Hout_Vochtigheid/100)*Hout_LHVm,\nIF(Hout_Doorzet_Dim=\"MJ\",Hout_Doorzet_Oogst_Eindgebruiker/1000,\nIF(Hout_Doorzet_Dim=\"GJ\",Hout_Doorzet_Oogst_Eindgebruiker,\nIF(Hout_Doorzet_Dim=\"kWh\",Hout_Doorzet_Oogst_Eindgebruiker*3.6/1000,\nIF(Hout_Doorzet_Dim=\"MWh\",Hout_Doorzet_Oogst_Eindgebruiker*3.6)))))))))","v":31006.492200000001},"GJ","Uit_Drogen_Hout_Doorzet_GJJ",null,null,"GJ",null,{"$f":"Uit_Drogen_Na_Hout_Doorzet_tonds*Drogen_Na_Hout_LHVds","v":28881.265132897199},"GJ",{"$f":"Uit_Drogen_Hout_Doorzet_GJ","v":31006.492200000001},{"$f":"Uit_Drogen_Na_Hout_Doorzet_MJ/1000","v":28881.265132897199},null,null,null,"GJ"]
[null,"Doorzet",null,{"$f":"Uit_Drogen_Hout_Doorzet_GJ/3.6*1000","v":8612914.5},"kWh","Uit_Drogen_Hout_Doorzet_kWh",null,null,"MWh",null,{"$f":"Uit_Drogen_Na_Hout_Doorzet_MJ/3.6","v":8022573.6480269991},"kWh",{"$f":"Uit_Drogen_Hout_Doorzet_kWh*3.6/1000","v":31006.492200000001},{"$f":"Uit_Drogen_Na_Hout_Doorzet_kWh*3.6/1000","v":28881.265132897199},null,null,null,"GJ"]
[null,"Doorzet",null,{"$f":"Uit_Drogen_Hout_Doorzet_GJ/3.6","v":8612.9145000000008},"MWh","Uit_Drogen_Hout_Doorzet_MWh",null,null,"kWh",null,{"$f":"Uit_Drogen_Na_Hout_Doorzet_GJ/3.6","v":8022.5736480269998},"MWh",{"$f":"Uit_Drogen_Hout_Doorzet_MWh*3.6","v":31006.492200000004},{"$f":"Uit_Drogen_Na_Hout_Doorzet_MWh*3.6","v":28881.265132897199},null,null,null,"GJ"]
[]
[]
[null,"Doorzet_Dim",null,{"$f":"Samenvatting_Drogen_Doorzet_Dim","v":"MJ"},null,"Samenvatting_Drogen_Doorzet_Dim"]
[null,"Doorzet",null,{"$f":"IF(Samenvatting_Drogen_Doorzet_Dim=\"m3\",Uit_Drogen_Hout_Doorzet_m3,\nIF(Samenvatting_Drogen_Doorzet_Dim=\"kg\",Uit_Drogen_Hout_Doorzet_kg,\nIF(Samenvatting_Drogen_Doorzet_Dim=\"kgds\",Uit_Drogen_Hout_Doorzet_kgds,\nIF(Samenvatting_Drogen_Doorzet_Dim=\"ton\",Uit_Drogen_Hout_Doorzet_ton,\nIF(Samenvatting_Drogen_Doorzet_Dim=\"tonds\",Uit_Drogen_Hout_Doorzet_tonds,\nIF(Samenvatting_Drogen_Doorzet_Dim=\"GJ\",Uit_Drogen_Hout_Doorzet_GJ,\nIF(Samenvatting_Drogen_Doorzet_Dim=\"MJ\",Uit_Drogen_Hout_Doorzet_MJ,\nIF(Samenvatting_Drogen_Doorzet_Dim=\"MWh\",Uit_Drogen_Hout_Doorzet_MWh,\nIF(Samenvatting_Drogen_Doorzet_Dim=\"kWh\",Uit_Drogen_Hout_Doorzet_kWh)))))))))","v":31006492.199999999},null,"Samenvatting_Drogen_Doorzet"]
[]
[]
[null,"Water in Hout",null,{"$f":"Drogen_Hout_Water","v":585.48},"kg","Drogen_Hout_Water"]
[null,"Doorzet Hout",null,{"$f":"Uit_Drogen_Hout_Doorzet_m3","v":10000},"m3","Uit_Drogen_Hout_Doorzet_m3"]
[null,"Vormfactor",null,{"$f":"Drogen_Hout_Vorm_Vulling","v":0.4},"-","Drogen_Hout_Vorm_Vulling"]
[null,"Water totaal in Hout",null,{"$f":"Drogen_Hout_Water*Uit_Drogen_Hout_Doorzet_m3*Drogen_Hout_Vorm_Vulling","v":2341920},"kg"]
[null,"Water in hout na drogen",null,{"$f":"Drogen_Na_Hout_Water","v":250.92000000000004}]
[null,"Doorzet hout na drogen"]
[]
[]
[null,"Water na Drogen",null,{"$f":"Proces_Water","v":535.51800000000003},"kg","Proces_Water"]
[null,"Doorzet Proces",null,{"$f":"Uit_Proces_Doorzet_m3","v":10000},"m3","Uit_Proces_Doorzet_m3"]
[null,"Vormfactor",null,{"$f":"Proces_Vorm_Vulling","v":0.33},"-","Proces_Vorm_Vulling"]
[null,"Water totaal na Proces",null,{"$f":"Proces_Water*Uit_Proces_Doorzet_m3*Proces_Vorm_Vulling","v":1767209.4000000001},"kg"]
[null,"Water verdampt",null,{"$f":"Hout_Water*Uit_Hout_Doorzet_m3*Hout_Vorm_Vulling-Proces_Water*Uit_Proces_Doorzet_m3*Proces_Vorm_Vulling","v":36065.497959183063},"kg","Uit_Proces_Water_Verdampt"]
[null,"Specifiek verbruik",null,{"$f":"IF(Proces_Warmtetoevoer_ID=0,0,1100)","v":{"$error":"#NAME?"}},"kWh/ton verdampt water","Uit_Proces_Water_Energie_Ton",null,null,"JRC  p 92"]
[null,"Warmtebehoefte",null,{"$f":"Uit_Proces_Water_Verdampt*Uit_Proces_Water_Energie_Ton/1000","v":{"$error":"#NAME?"}},"kWh"]
[null,"Rendement warmteproductie",null,{"$f":"Drogen_Warmtebenutting","v":90},"%","Proces_Drogen_Warmtebenutting"]
[null,"Warmtebehoefte",null,{"$f":"IF(Drogen_Warmtebenutting=0,0,Uit_Proces_Water_Verdampt*Uit_Proces_Water_Energie_Ton/1000*Drogen_Warmtebenutting/100)","v":{"$error":"#NAME?"}},"kWh","Uit_Proces_Warmte_kWh"]
[null,"Warmtebehoefte",null,{"$f":"Uit_Proces_Warmte_kWh*3.6","v":{"$error":"#NAME?"}},"MJ","Uit_Proces_Warmte_MJ"]
[null,"Aandeel Brandstof",null,{"$f":"Uit_Proces_Warmte_MJ*(1-Drogen_Aandeel_Elektriciteit/100)","v":{"$error":"#NAME?"}},"MJ"]
[null,"Aandeel elektriciteit",null,{"$f":"Uit_Proces_Warmte_MJ*Drogen_Aandeel_Elektriciteit/100","v":{"$error":"#NAME?"}},"MJ"]
[]
[null,"Brandstof",null,{"$f":"Drogen_Brandstof","v":"EU-Diesel"},null,"Proces_Drogen_Brandstof"]
[null,"Brandstof dimensie",null,{"$f":"Drogen_Brandstofverbruik_Dim","v":"kWh"},"-","Proces_Drogen_Brandstofverbruik_Dim"]
[null,"Brandstoffen-RHO",null,{"$f":"IF(Proces_Warmtetoevoer_ID=1,IF(Drogen_Brandstof=\"\",0,LOOKUP(Drogen_Brandstof,Lijst_Fossiel_Soort,Lijst_Fossiel_RHO_kg_m3)),0)","v":{"$error":"#NAME?"}}]
[null,"Brandstoffen-LHVv",null,{"$f":"IF(Proces_Warmtetoevoer_ID=1,IF(Drogen_Brandstof=\"\",0,LOOKUP(Drogen_Brandstof,Lijst_Fossiel_Soort,Lijst_Fossiel_LHV_GJ_m3)),0)","v":{"$error":"#NAME?"}}]
[null,"Brandstoffen-LHVm",null,{"$f":"IF(Proces_Warmtetoevoer_ID=1,IF(Drogen_Brandstof=\"\",0,LOOKUP(Drogen_Brandstof,Lijst_Fossiel_Soort,Lijst_Fossiel_LHV_MJ_kg)),0)","v":{"$error":"#NAME?"}}]
[null,"Brandstofverbruik",null,{"$f":"Uit_Proces_Warmte_Brandstof_MJ/Uit_Proces_Warmte_Brandstof_LHV_GJ_m3/1000","v":{"$error":"#NAME?"}},"m3","Uit_Proces_Drogen_Brandstofverbruik_m3",null,null,null,{"$f":"Uit_Proces_Drogen_Brandstofverbruik_m3*Uit_Proces_Warmte_Brandstof_LHV_GJ_m3","v":{"$error":"#NAME?"}}]
[null,"Brandstofverbruik",null,{"$f":"Uit_Proces_Warmte_Brandstof_MJ/Uit_Proces_Warmte_Brandstof_LHV_MJ_kg","v":{"$error":"#NAME?"}},"kg","Uit_Proces_Drogen_Brandstofverbruik_kg",null,null,null,{"$f":"Uit_Proces_Drogen_Brandstofverbruik_kg*Uit_Proces_Warmte_Brandstof_LHV_MJ_kg/1000","v":{"$error":"#NAME?"}}]
[null,"Brandstofverbruik",null,{"$f":"Uit_Proces_Drogen_Brandstofverbruik_m3*1000","v":{"$error":"#NAME?"}},"liter","Uit_Proces_Drogen_Brandstofverbruik_liter",null,null,null,{"$f":"Uit_Proces_Drogen_Brandstofverbruik_liter*Uit_Proces_Warmte_Brandstof_LHV_GJ_m3/1000","v":{"$error":"#NAME?"}}]
[null,"Brandstofverbruik",null,{"$f":"Uit_Proces_Drogen_Brandstofverbruik_kg/1000","v":{"$error":"#NAME?"}},"ton","Uit_Proces_Drogen_Brandstofverbruik_ton"]
[null,"Brandstofverbruik",null,{"$f":"Uit_Proces_Warmte_Brandstof_MJ/1000","v":{"$error":"#NAME?"}},"GJ","Uit_Proces_Drogen_Brandstofverbruik_GJ",null,null,null,{"$f":"Uit_Proces_Drogen_Brandstofverbruik_GJ","v":{"$error":"#NAME?"}}]
[null,"Brandstofverbruik",null,{"$f":"Uit_Proces_Drogen_Brandstofverbruik_MWh*1000","v":{"$error":"#NAME?"}},"kWh","Uit_Proces_Drogen_Brandstofverbruik_kWh"]
[null,"Brandstofverbruik",null,{"$f":"Uit_Proces_Drogen_Brandstofverbruik_GJ/3.6","v":{"$error":"#NAME?"}},"MWh","Uit_Proces_Drogen_Brandstofverbruik_MWh"]
[null,"Brandstofverbruik",null,{"$f":"IF(Drogen_Brandstofverbruik_Dim=\"m3\",Uit_Proces_Drogen_Brandstofverbruik_m3,\nIF(Drogen_Brandstofverbruik_Dim=\"kg\",Uit_Proces_Drogen_Brandstofverbruik_kg,\nIF(Drogen_Brandstofverbruik_Dim=\"liter\",Uit_Proces_Drogen_Brandstofverbruik_liter,\nIF(Drogen_Brandstofverbruik_Dim=\"ton\",Uit_Proces_Drogen_Brandstofverbruik_ton,\nIF(Drogen_Brandstofverbruik_Dim=\"GJ\",Uit_Proces_Drogen_Brandstofverbruik_GJ,\nIF(Drogen_Brandstofverbruik_Dim=\"kWh\",Uit_Proces_Drogen_Brandstofverbruik_kWh,\nIF(Drogen_Brandstofverbruik_Dim=\"MWh\",Uit_Proces_Drogen_Brandstofverbruik_MWh,0)))))))","v":{"$error":"#NAME?"}},{"$f":"Drogen_Brandstofverbruik_Dim","v":"kWh"},"Uit_Proces_Drogen_Brandstofverbruik"]
[]
[null,"Elektriciteit",null,{"$f":"Drogen_Stroombron","v":"EU-Elektriciteit EU mix (0.4 kV)"},null,"Proces_Drogen_Stroombron"]
[null,"Elektriciteitverbruik",null,{"$f":"Uit_Proces_Warmte_Elektriciteit_MJ/1000/3.6","v":{"$error":"#NAME?"}},"MWh","Uit_Proces_Drogen_Elektriciteitsverbruik_MWh"]
[null,"Elektriciteitverbruik",null,{"$f":"Uit_Proces_Drogen_Elektriciteitsverbruik_MWh*3.6","v":{"$error":"#NAME?"}},"GJ","Uit_Proces_Drogen_Elektriciteitsverbruik_GJ"]
[null,"Elektriciteitverbruik",null,{"$f":"Uit_Proces_Drogen_Elektriciteitsverbruik_MWh*1000","v":{"$error":"#NAME?"}},"kWh","Uit_Proces_Drogen_Elektriciteitsverbruik_kWh"]
[null,"Elektriciteitverbruik",null,{"$f":"Uit_Proces_Drogen_Elektriciteitsverbruik_kWh*3.6","v":{"$error":"#NAME?"}},"MJ","Uit_Proces_Drogen_Elektriciteitsverbruik_MJ"]
[null,"Elektriciteitverbruik",null,{"$f":"IF(Drogen_Stroomverbruik_Dim=\"kWh\",Uit_Proces_Drogen_Elektriciteitsverbruik_kWh,\nIF(Drogen_Stroomverbruik_Dim=\"MJ\",Uit_Proces_Drogen_Elektriciteitsverbruik_MJ,\nIF(Drogen_Stroomverbruik_Dim=\"MWh\",Uit_Proces_Drogen_Elektriciteitsverbruik_MWh,0)))","v":{"$error":"#NAME?"}},{"$f":"Drogen_Stroomverbruik_Dim","v":"kWh"},"Uit_Proces_Drogen_Elektriciteitsverbruik"]
[]
[null,"Methodiek",null,{"$f":"Algemeen_Berekening_Methodiek_ID","v":"EU"},null,"Algemeen_Berekening_Methodiek_ID"]
[null,"CO2 eq Brandstof",null,{"$f":"IF(Algemeen_Berekening_Methodiek_ID=\"EU\",LOOKUP(Drogen_Brandstof,Lijst_Brandstof_EU_Soort,Lijst_Brandstof_EU_CO2eq),\nIF(Algemeen_Berekening_Methodiek_ID=\"NL\",LOOKUP(Drogen_Brandstof,Lijst_Brandstof_NL_Soort,Lijst_Brandstof_NL_CO2eq),\nLOOKUP(Drogen_Brandstof,Lijst_Brandstof_Methodiek_Beide_Soort,Lijst_Brandstof_Methodiek_Beide_CO2eq)))","v":93.947222222222209},"gCO2eq/MJ","Uit_Proces_Brandstof_CO2eq_g_MJ",null,null,null,null,null,{"$f":"IF(Algemeen_Berekening_Methodiek_ID=\"EU\",LOOKUP(Drogen_Brandstof,Lijst_Brandstof_EU_Soort,Lijst_Brandstof_EU_CO2eq),\nIF(Algemeen_Berekening_Methodiek_ID=\"NL\",LOOKUP(Drogen_Stroombron,Lijst_Brandstof_NL_Soort,Lijst_Brandstof_NL_CO2eq),\nLOOKUP(Drogen_Stroombron,Lijst_Brandstof_Methodiek_Beide_Soort,Lijst_Brandstof_Methodiek_Beide_CO2eq)))","v":93.947222222222209}]
[null,"CO2 eq Elektriciteit",null,{"$f":"IF(Algemeen_Berekening_Methodiek_ID=\"EU\",LOOKUP(Drogen_Stroombron,Lijst_Elektriciteit_EU_Soort,Lijst_Elektriciteit_EU_CO2eq),\nIF(Algemeen_Berekening_Methodiek_ID=\"NL\",LOOKUP(Drogen_Stroombron,Lijst_Elektriciteit_NL_Soort,Lijst_Elektriciteit_NL_CO2eq),\nLOOKUP(Drogen_Stroombron,Lijst_Elektriciteit_Methodiek_Beide_Soort,Lijst_Elektriciteit_Methodiek_Beide_CO2eq)))","v":208.83000000000004},"gCO2eq/MJ","Uit_Proces_Elektriciteit_CO2eq_g_MJ"]
[null,"CO2 eq Drogen",null,{"$f":"Uit_Proces_Brandstof_CO2eq_g_MJ*Uit_Proces_Drogen_Brandstofverbruik_GJ*1000\n+Uit_Proces_Elektriciteit_CO2eq_g_MJ*Uit_Proces_Drogen_Elektriciteitsverbruik_MJ","v":{"$error":"#NAME?"}},"gCO2eq","Uit_Proces_Drogen_CO2eq_g"]
[null,"CO2 eq Drogen",null,{"$f":"Uit_Proces_Drogen_CO2eq_g/1000","v":{"$error":"#NAME?"}},"kg","Uit_Proces_Drogen_CO2eq_kg"]
[null,"CO2 eq Drogen",null,{"$f":"D699/1000","v":{"$error":"#NAME?"}},"ton","Uit_Proces_Drogen_CO2eq_ton"]
[null,"CO2 eq Drogen",null,{"$f":"Uit_Proces_Drogen_CO2eq_g/Uit_Proces_Doorzet_MJ","v":{"$error":"#NAME?"}},"gCO2eq/MJ","Uit_Proces_Drogen_CO2eq_g_MJ"]
[null,"Doorzet invoer",null,{"$f":"Uit_Hout_Doorzet_MJ","v":34803205.530612245},"GJ","Uit_Hout_Doorzet_GJ"]
[null,"Doorzet uitvoer",null,{"$f":"Uit_Proces_Doorzet_MJ","v":34107141.420000002},"GJ","Uit_Proces_Doorzet_GJ"]
[null,null,null,{"$f":"IF(Uit_Proces_Invoer_Uitvoer_Dim=\"Invoer\",\nIF(Uit_Hout_Doorzet_MJ=0,0,Uit_Proces_Drogen_CO2eq_g/Uit_Hout_Doorzet_MJ),\nIF(Uit_Proces_Doorzet_MJ=0,0,Uit_Proces_Drogen_CO2eq_g/Uit_Proces_Doorzet_MJ))","v":{"$error":"#NAME?"}},"gCO2eq/MJ","Uit_Proces_Drogen_CO2eq"]

{"sheet":"Data","index":11,"n_rows":311,"n_cols":43,"rows_kept":311,"cut":false,"hidden":true,"merged":[[11,2,11,6],[43,2,43,20]]}
[]
[null,"Inhoudsopgave"]
[]
[null,null,"Inhoud",null,null,"Rijnummer"]
[]
[null,null,null,"Global Warming Potentials",null,{"$f":"Rij_Global_Warming_Potentials","v":12}]
[null,null,null,"Houteigenschappen",null,{"$f":"Rij_Data_Hout_Eigenschappen","v":17}]
[null,null,null,"Houtvorm",null,{"$f":"Rij_Data_Hout_Vorm","v":46}]
[null,null,null,"Basisdata JRC-2017",null,{"$f":"Rij_Data_JRC_Basis","v":69}]
[]
[]
[null,{"$f":"ROW()","v":12},"Global Warming Potentials"]
[null,null,null,"CO2",1]
[null,null,null,"CH4",25]
[null,null,null,"N2O",298]
[]
[null,{"$f":"ROW()","v":17},"Hout eigenschappen"]
[]
[null,null,"Nr","Soort","H2","HHV","Darr","Krimp","VVP",null,null,null,null,null,null,null,null,null,null,null,null,null,null,null,null,null,null,null,null,null,null,null,null,null,null,null,null,"Processen"]
[null,null,null,null,"%","MJ/kgds","kgds/m3","%","%"]
[null,null,1,"Berken",6,19.3,640,13.9,23,null,null,null,null,null,null,null,null,null,null,null,null,null,null,null,null,null,null,null,null,null,null,null,null,null,null,null,null,1,"Chippen",null,null,null,"Blokken (gestapeld)"]
[null,null,{"$f":"C21+1","v":2},"Beuken",6,19.3,680,17.899999999999999,23,null,null,null,null,null,null,null,null,null,null,null,null,null,null,null,null,null,null,null,null,null,null,null,null,null,null,null,null,2,"Zagen",null,null,null,"Blokken (los gestort)"]
[null,null,3,"Douglas",6.2,20.399999999999999,470,11.9,23,null,null,null,null,null,null,null,null,null,null,null,null,null,null,null,null,null,null,null,null,null,null,null,null,null,null,null,null,3,"Forwarden",null,null,null,"Chips G100/P63"]
[null,null,4,"Eiken",6,19.3,680,13.9,23,null,null,null,null,null,null,null,null,null,null,null,null,null,null,null,null,null,null,null,null,null,null,null,null,null,null,null,null,4,"Opslaan",null,null,null,"Chips G30/P16"]
[null,null,5,"Elzen",6,19.3,490,13.1,23,null,null,null,null,null,null,null,null,null,null,null,null,null,null,null,null,null,null,null,null,null,null,null,null,null,null,null,null,5,"Omzetten",null,null,null,"Chips G50/P31,5"]
[null,null,6,"Esdoorn",6,19.3,600,11.5,23,null,null,null,null,null,null,null,null,null,null,null,null,null,null,null,null,null,null,null,null,null,null,null,null,null,null,null,null,null,null,null,null,null,"Massief"]
[null,null,7,"Essen",6,19.3,670,13.2,23,null,null,null,null,null,null,null,null,null,null,null,null,null,null,null,null,null,null,null,null,null,null,null,null,null,null,null,null,null,null,null,null,null,"Pellets - ENplus"]
[null,null,8,"Fijnspar (EU)",6.2,20.399999999999999,425,11.7,23]
[null,null,9,"Fruit",6,19.3,690,13.9,23,null,null,null,null,null,null,null,null,null,null,null,null,null,null,null,null,null,null,null,null,null,null,null,null,null,null,null,null,null,null,null,null,null,"Snoeihout-dicht"]
[null,null,10,"Grenen",6.2,20.399999999999999,510,12.1,23,null,null,null,null,null,null,null,null,null,null,null,null,null,null,null,null,null,null,null,null,null,null,null,null,null,null,null,null,null,null,null,null,null,"Snoeihout-los"]
[null,null,11,"Kastanje",6,19.3,530,11.3,23,null,null,null,null,null,null,null,null,null,null,null,null,null,null,null,null,null,null,null,null,null,null,null,null,null,null,null,null,null,null,null,null,null,"Stapelmeter of stère, brandhout"]
[null,null,12,"Linden",6,19.3,520,14.9,23,null,null,null,null,null,null,null,null,null,null,null,null,null,null,null,null,null,null,null,null,null,null,null,null,null,null,null,null,null,null,null,null,null,"Stapelmeter of stère, zagerijhout"]
[null,null,13,"Loofhout mix NL",6,19.3,633,15.4,23,null,null,null,null,null,null,null,null,null,null,null,null,null,null,null,null,null,null,null,null,null,null,null,null,null,null,null,null,null,null,null,null,null,"Top- en takhout"]
[null,null,14,"Loofhout naaldhout mix NL ",6.1,19.8,570,13.6,23,null,null,null,null,null,null,null,null,null,null,null,null,null,null,null,null,null,null,null,null,null,null,null,null,null,null,null,null,null,null,null,null,null,"Zaagsel "]
[null,null,15,"Naaldhout mix NL",6.2,20.399999999999999,505,11.7,23]
[null,null,16,"Populieren",6,19.3,410,13.8,23]
[null,null,17,"Robinia",6,19.3,730,10.6,23]
[null,null,18,"Vuren",6.2,20.399999999999999,430,11.7,23]
[null,null,19,"Wilgen",6,19.3,520,10.199999999999999,23]
[]
[null,null,"Bronnen","Klima:aktiv, kalkulationsblatt zur ermittlung von Kenndaten und Preisen fur enrgieholzsortimenten, version 1.6 "]
[null,null,null,"De laatste versie is te vinden op: www.energieholz.klimaaktiv.at"]
[null,null,null,"Empfohlene Umrechnungsfaktoren für Energieholzsortimente bei Holz- bzw. Energiebilanzberechnungen, 2009 klima:aktiv"]
[]
[]
[null,{"$f":"ROW()","v":46},"Hout vorm"]
[]
[null,null,"Nr","Vorm","Factor","As-gehalte"]
[null,null,1,"Blokken (gestapeld)",0.63,1]
[null,null,2,"Blokken (los gestort)",0.41,1]
[null,null,3,"Chips G100/P63",0.33,6]
[null,null,4,"Chips G30/P16",0.4,6]
[null,null,5,"Chips G50/P31,5",0.33,1.5]
[null,null,6,"Massief",1,1.5]
[null,null,7,"Pellets - ENplus",1.1020000000000001,1.5]
[null,null,8,"Rondhout",0.75,1.5]
[null,null,9,"Shreds-20",0.35,5,null,"Checken"]
[null,null,10,"Shreds-40",0.35,5,null,"Checken"]
[null,null,11,"Shreds-60",0.35,5,null,"Checken"]
[null,null,14,"Shreds-80",0.35,5,null,"Checken"]
[null,null,15,"Snoeihout-dicht",0.2,1.5]
[null,null,16,"Snoeihout-los",0.1,0.3]
[null,null,17,"Stapelmeter of stère, brandhout",0.57499999999999996,1]
[null,null,18,"Stapelmeter of stère, zagerijhout",0.68,4]
[null,null,19,"Top- en takhout",0.3,2]
[null,null,20,"Zaagsel ",0.6,1]
[]
[]
[null,{"$f":"ROW()","v":69},"Basisdata JRC"]
[]
[null,null,null,"Dichtheid hout (fijnspar)",425,"kgds/m3"]
[null,null,null,"Vochtigheid",50,"%"]
[null,null,null,"Energiewaarde hout",19,"MJ/kgds"]
[null,null,null,"Energiewaarde diesel",36,"MJ/liter"]
[null,null,null,"Dieselverbruik 40 ton truck",30.53,"liter/100km"]
[null,null,null,"Belading",50,"%"]
[null,null,null,"CO2 diesel",93.947222222222209,"gCO2/MJ"]
[]
[null,null,null,"Vrachtwagen",40,"ton"]
[null,null,null,"Pay load vrachtwagen",27,"ton"]
[null,null,null,"Tank",1,"ton"]
[]
[null,null,"Bron","Giuntoli, J., Agostini, A., Edwards, R., & Marelli, L. (2017) ofwel JRC 2017"]
[]
[]
[null,{"$f":"ROW()","v":86},"Brandstof fossiel"]
[]
[null,null,"Nr","Fuel","RHO\nkg/m3","LHV\nGJ/m3","LHV\nMJ/kg","CO2\ngCO2/MJ","CH4\ngCH4/MJ","N2O\ngN2O/MJ","GHG\ngCO2-eq/MJ"]
[null,null,1,"Aardgas",0.83299999999999996,{"$f":"31.678*0.001","v":3.1678000000000005E-2},{"$f":"F89/E89*1000","v":38.02881152460985},66.45427777777779,0.20744444444444443,3.6111111111111109E-4,{"$f":"H89*JRC_GWP_CO2+JRC_GWP_CH4*I89+JRC_GWP_N2O*J90","v":71.640388888888907}]
[null,null,2,"Benzine",720,{"$f":"E90*G90/1000","v":33.775199999999998},46.91,92.419444444444451,null,null,92.419444444444451]
[null,null,5,"Diesel",850,{"$f":"E91*G91/1000","v":35.512999999999998},41.78,93.947222222222209,null,null,94.021722222222209]
[null,null,6,"Kolen",850,{"$f":"33*E92/1000","v":28.05},{"$f":"F92/E92*1000","v":33},102.61605555555555,0.3853611111111111,2.5000000000000001E-4,112.2583611111111]
[null,null,3,"LPG",600,{"$f":"G93/1000*E93","v":27.428761848341232},45.714603080568715,72.87444444444445,1.563888888888889E-2,2.7777777777777799E-5,73.265416666666667]
[null,null,8,"Stookolie",850,{"$f":"41.9*E94/1000","v":35.615000000000002},{"$f":"F94/E94*1000","v":41.9},93.3,null,null,93.3]
[]
[]
[]
[]
[null,{"$f":"ROW()","v":99},"Elektriciteit"]
[]
[null,null,"Nr","Elektriciteit_Biograce2","CO2\ngCO2/MJ","CH4\ngCH4/MJ","N2O\ngN2O/MJ","GHG\ngCO2-eq/MJ"]
[null,null,5,"EU-Elektriciteit BE",56.7,7.6700000000000004E-2,3.2100000000000002E-3,{"$f":"E102*JRC_GWP_CO2+F102*JRC_GWP_CH4+G102*JRC_GWP_N2O","v":59.574080000000002}]
[null,null,4,"EU-Elektriciteit DE",163,0.19800000000000001,7.9299999999999995E-3,{"$f":"E103*JRC_GWP_CO2+F103*JRC_GWP_CH4+G103*JRC_GWP_N2O","v":170.31313999999998}]
[null,null,2,"EU-Elektriciteit EU mix (0.4 kV)",189.79991666666669,0.67974999999999997,6.8333333333333336E-3,{"$f":"E104*JRC_GWP_CO2+F104*JRC_GWP_CH4+G104*JRC_GWP_N2O","v":208.83000000000004}]
[null,null,1,"EU-Elektriciteit EU mix (10-20 kV)",178.45041666666668,0.63908333333333334,6.4444444444444436E-3,{"$f":"E105*JRC_GWP_CO2+F105*JRC_GWP_CH4+G105*JRC_GWP_N2O","v":196.34794444444447}]
[null,null,3,"EU-Elektriciteit NL",141,0.159,5.7499999999999999E-3,{"$f":"E106*JRC_GWP_CO2+F106*JRC_GWP_CH4+G106*JRC_GWP_N2O","v":146.6885}]
[]
[]
[null,null,"Nr","Elektriciteit_CO2_Emissiefactoren","CO2\ngCO2/MJ","CH4\ngCH4/MJ","N2O\ngN2O/MJ","GHG\ngCO2-eq/MJ"]
[null,null,4,"NL-Elektriciteit biomassa",{"$f":"0.075/3.6*1000","v":20.833333333333332},0,0,{"$f":"E110*JRC_GWP_CO2+F110*JRC_GWP_CH4+G110*JRC_GWP_N2O","v":20.833333333333332},null,"CO2-emissiefactoren geeft geen waarden voor CO2, CH4 en N2O"]
[null,null,5,"NL-Elektriciteit grijs",{"$f":"0.649/3.6*1000","v":180.2777777777778},0,0,{"$f":"E111*JRC_GWP_CO2+F111*JRC_GWP_CH4+G111*JRC_GWP_N2O","v":180.2777777777778},null,"CO2-emissiefactoren geeft geen waarden voor CO2, CH4 en N2O"]
[null,null,2,"NL-Elektriciteit water",0,0,0,{"$f":"E112*JRC_GWP_CO2+F112*JRC_GWP_CH4+G112*JRC_GWP_N2O","v":0},null,"CO2-emissiefactoren geeft geen waarden voor CO2, CH4 en N2O"]
[null,null,1,"NL-Elektriciteit wind",0,0,0,{"$f":"E113*JRC_GWP_CO2+F113*JRC_GWP_CH4+G113*JRC_GWP_N2O","v":0},null,"CO2-emissiefactoren geeft geen waarden voor CO2, CH4 en N2O"]
[null,null,3,"NL-Elektriciteit zon",0,0,0,{"$f":"E114*JRC_GWP_CO2+F114*JRC_GWP_CH4+G114*JRC_GWP_N2O","v":0},null,"CO2-emissiefactoren geeft geen waarden voor CO2, CH4 en N2O"]
[]
[]
[null,null,"Nr","Elektriciteit_Biograce2-CO2 emissiefactoren","CO2\ngCO2/MJ","CH4\ngCH4/MJ","N2O\ngN2O/MJ","GHG\ngCO2-eq/MJ"]
[null,null,null,"EU-Elektriciteit BE",56.7,7.6700000000000004E-2,3.2100000000000002E-3,{"$f":"E118*JRC_GWP_CO2+F118*JRC_GWP_CH4+G118*JRC_GWP_N2O","v":59.574080000000002}]
[null,null,null,"EU-Elektriciteit DE",163,0.19800000000000001,7.9299999999999995E-3,170.31313999999998]
[null,null,null,"EU-Elektriciteit EU mix (0.4 kV)",189.79991666666669,0.67974999999999997,6.8333333333333336E-3,208.83000000000004]
[null,null,null,"EU-Elektriciteit EU mix (10-20 kV)",178.45041666666668,0.63908333333333334,6.4444444444444436E-3,196.34794444444447]
[null,null,null,"EU-Elektriciteit NL",141,0.159,5.7499999999999999E-3,146.6885]
[null,null,null,"NL-Elektriciteit biomassa",{"$f":"0.075/3.6*1000","v":20.833333333333332},0,0,20.833333333333332,null,"CO2-emissiefactoren geeft geen waarden voor CO2, CH4 en N2O"]
[null,null,null,"NL-Elektriciteit grijs",{"$f":"0.649/3.6*1000","v":180.2777777777778},0,0,180.2777777777778,null,"CO2-emissiefactoren geeft geen waarden voor CO2, CH4 en N2O"]
[null,null,null,"NL-Elektriciteit water",0,0,0,0,null,"CO2-emissiefactoren geeft geen waarden voor CO2, CH4 en N2O"]
[null,null,null,"NL-Elektriciteit wind",0,0,0,0,null,"CO2-emissiefactoren geeft geen waarden voor CO2, CH4 en N2O"]
[null,null,null,"NL-Elektriciteit zon",0,0,0,0,null,"CO2-emissiefactoren geeft geen waarden voor CO2, CH4 en N2O"]
[]
[]
[null,null,{"$f":"ROW()","v":130},"Brandstof"]
[]
[null,null,"Nr","Brandstof - Biograce2","Dichtheid\nkg/m3","LHV\nGJ/m3","LHV\nMJ/kg","gCO2/MJ","gCH4/MJ","gN2O/MJ","gCO2eq/MJ","gCO2eq/MJ"]
[null,null,null,"EU-Aardgas",0.83299999999999996,{"$f":"31.678*0.001","v":3.1678000000000005E-2},49.2,66.45427777777779,0.20744444444444443,3.6111111111111109E-4,{"$f":"JRC_GWP_CO2*H133+JRC_GWP_CH4*I133+JRC_GWP_N2O*J133","v":71.748000000000019},null,null,null,"Marginal supply of natural gas based on a combination of various JEC pathways"]
[null,null,null,"EU-Benzine",745,{"$f":"G134*E134/1000","v":32.184000000000005},43.2,92.419444444444451,0,0,{"$f":"JRC_GWP_CO2*H134+JRC_GWP_CH4*I134+JRC_GWP_N2O*J134","v":92.419444444444451},null,null,null,"JRC scientific report EUR 27215 EN *"]
[null,null,null,"EU-Diesel",832,{"$f":"G135*E135/1000","v":35.859200000000001},43.1,93.947222222222209,0,0,{"$f":"JRC_GWP_CO2*H135+JRC_GWP_CH4*I135+JRC_GWP_N2O*J135","v":93.947222222222209},null,null,null,"JRC scientific report EUR 27215 EN *"]
[null,null,null,"EU-Diesel - Heavy Fuel Oil (1,8% S)",970,{"$f":"G136*E136/1000","v":39.284999999999997},40.5,93.3,0,0,{"$f":"JRC_GWP_CO2*H136+JRC_GWP_CH4*I136+JRC_GWP_N2O*J136","v":93.3},null,null,null,"JRC scientific report EUR 27215 EN *"]
[]
[]
[]
[]
[]
[null,null,"Nr","Brandstof - CO2 Emissiefactoren","Dichtheid\nkg/m3","LHV\nMJ/liter","LHV\nMJ/kg","gCO2/MJ","gCH4/MJ","gN2O/MJ","gCO2eq/MJ","kgCO2eq/l","kgCO2eq/kg","kgCO2eq/Nm3"]
[null,null,null,"NL-Aardgas",0.83299999999999996,{"$f":"31.678/1000","v":3.1677999999999998E-2},{"$f":"F143/E143*1000","v":38.028811524609843},{"$f":"F143*N143*1000","v":59.871419999999993},0,0,{"$f":"JRC_GWP_CO2*H143+JRC_GWP_CH4*I143+JRC_GWP_N2O*J143","v":59.871419999999993},null,{"$f":"G143*K143/1000","v":2.2768389468907557},1.89,"CO2eq/Nm3 is van Basisegevens Aaardgas (Gasunie). CO2eq/liter is van CO2-emissiefactoren. Overige data van Biograce2\n is van CO2-emissiefactoren. Overige data van Biograce2"]
[null,null,null,"NL-Aardgas-CNG",453,{"$f":"E144*G144/1000","v":21.117482880000004},{"$f":"1.3*E148/1000*G148","v":46.616960000000006},{"$f":"M144*1000/G144","v":58.519474457364865},0,0,58.519474457364865,null,2.7280000000000002,null,"Omrekening: 1 kg CNG = 1,3 liter diesel"]
[null,null,null,"NL-Benzine",745,{"$f":"G145*E145/1000","v":32.184000000000005},43.2,{"$f":"L145*F145","v":88.18416000000002},0,0,88.18416000000002,2.74,{"$f":"G145*K145/1000","v":3.8095557120000012},null,"CO2eq/liter is van CO2-emissiefactoren. Overige data van Biograce2"]
[null,null,null,"NL-Bio-CNG (Groengas)",453,{"$f":"E146*G146/1000","v":19.569600000000001},{"$f":"G145","v":43.2},{"$f":"M146*1000/G146","v":24.050925925925924},0,0,24.050925925925924,null,1.0389999999999999,null,"CO2eq/liter is van CO2-emissiefactoren. Overige data van Biograce2"]
[null,null,null,"NL-Biodiesel",880,32,36.36363636363636,{"$f":"L147*F147","v":100.928},0,0,100.928,3.1539999999999999,{"$f":"G147*K147/1000","v":3.6701090909090905},null,"CO2eq/liter is van CO2-emissiefactoren. Overige data van Biograce2"]
[null,null,null,"NL-Diesel",832,{"$f":"G148*E148/1000","v":35.859200000000001},43.1,{"$f":"L148*F148","v":115.825216},0,0,115.825216,3.23,{"$f":"G148*K148/1000","v":4.9920668095999998},null,"CO2eq/liter is van CO2-emissiefactoren. Overige data van Biograce2"]
[null,null,null,"NL-LPG",540,{"$f":"E149*G149/1000","v":24.408000000000001},45.2,66.7,0,0,66.7,1.806,null,null,"CO2eq/liter is van CO2-emissiefactoren. Overige data van Biograce2"]
[null,null,null,"NL-Waterstof",90.66,{"$f":"G150*E150/1000","v":10.824804},119.4,105,0,0,105,1.1359999999999999,{"$f":"G150*K150/1000","v":12.537000000000001},null,"CO2eq/liter is van CO2-emissiefactoren. Overige data van Biograce2"]
[]
[]
[null,null,"Reserve","NL-Aardgas (hoog calorisch)",0.75,0.04,{"$f":"F153/E153*1000","v":53.333333333333336}]
[]
[]
[]
[null,null,"Nr","Brandstof - Biograce2 + CO2 Emissiefactoren","Dichtheid\nkg/m3","LHV\nGJ/m3","LHV\nMJ/kg","gCO2/MJ","gCH4/MJ","gN2O/MJ","gCO2eq/MJ","gCO2eq/l",null,"kgCO2eq/Nm3"]
[null,null,null,"EU-Aardgas",null,null,49.2,66.45427777777779,0.20744444444444443,3.6111111111111109E-4,{"$f":"JRC_GWP_CO2*H158+JRC_GWP_CH4*I158+JRC_GWP_N2O*J158","v":71.748000000000019},null,null,null,"Marginal supply of natural gas based on a combination of various JEC pathways"]
[null,null,null,"EU-Benzine",745,{"$f":"G159*E159/1000","v":32.184000000000005},43.2,92.419444444444451,0,0,92.419444444444451,null,null,null,"JRC scientific report EUR 27215 EN *"]
[null,null,null,"EU-Diesel",832,{"$f":"G160*E160/1000","v":35.859200000000001},43.1,93.947222222222209,0,0,93.947222222222209,null,null,null,"JRC scientific report EUR 27215 EN *"]
[null,null,null,"EU-Diesel - HFO (1,8% S)",970,{"$f":"G161*E161/1000","v":39.284999999999997},40.5,93.3,0,0,93.3,null,null,null,"JRC scientific report EUR 27215 EN *"]
[null,null,null,"NL-Aardgas",0.83299999999999996,{"$f":"31.678/1000","v":3.1677999999999998E-2},{"$f":"F162/E162*1000","v":38.028811524609843},{"$f":"F162*N162*1000","v":59.871419999999993},0,0,59.871419999999993,null,{"$f":"G162*K162/1000","v":2.2768389468907557},1.89,"CO2eq/Nm3 is van Basisegevens Aaardgas (Gasunie). CO2eq/liter is van CO2-emissiefactoren. Overige data van Biograce2\n is van CO2-emissiefactoren. Overige data van Biograce2"]
[null,null,null,"NL-Aardgas-CNG",453,{"$f":"E163*G163/1000","v":21.117482880000004},{"$f":"1.3*E167/1000*G167","v":46.616960000000006},{"$f":"M163*1000/G163","v":58.519474457364865},0,0,58.519474457364865,null,2.7280000000000002,null,"Omrekening: 1 kg CNG = 1,3 liter diesel"]
[null,null,null,"NL-Benzine",745,{"$f":"G164*E164/1000","v":32.184000000000005},43.2,{"$f":"L164*F164","v":88.18416000000002},0,0,88.18416000000002,2.74,{"$f":"G164*K164/1000","v":3.8095557120000012},null,"CO2eq/liter is van CO2-emissiefactoren. Overige data van Biograce2"]
[null,null,null,"NL-Bio-CNG (Groengas)",453,{"$f":"E165*G165/1000","v":19.569600000000001},{"$f":"G164","v":43.2},{"$f":"M165*1000/G165","v":24.050925925925924},0,0,24.050925925925924,null,1.0389999999999999,null,"CO2eq/liter is van CO2-emissiefactoren. Overige data van Biograce2"]
[null,null,null,"NL-Biodiesel",880,32,36.36363636363636,{"$f":"L166*F166","v":100.928},0,0,100.928,3.1539999999999999,{"$f":"G166*K166/1000","v":3.6701090909090905},null,"CO2eq/liter is van CO2-emissiefactoren. Overige data van Biograce2"]
[null,null,null,"NL-Diesel",832,{"$f":"G167*E167/1000","v":35.859200000000001},43.1,{"$f":"L167*F167","v":115.825216},0,0,115.825216,3.23,{"$f":"G167*K167/1000","v":4.9920668095999998},null,"CO2eq/liter is van CO2-emissiefactoren. Overige data van Biograce2"]
[null,null,null,"NL-LPG",540,{"$f":"E168*G168/1000","v":24.408000000000001},45.2,66.7,0,0,66.7,1.806,null,null,"CO2eq/liter is van CO2-emissiefactoren. Overige data van Biograce2"]
[null,null,null,"NL-Waterstof (Vloeibaar)",90.66,{"$f":"G169*E169/1000","v":10.824804},119.4,105,0,0,105,1.1359999999999999,{"$f":"G169*K169/1000","v":12.537000000000001},null,"CO2eq/liter is van CO2-emissiefactoren. Overige data van Biograce2"]
[]
[]
[]
[]
[]
[]
[]
[]
[]
[]
[]
[]
[]
[]
[]
[]
[]
[]
[]
[]
[]
[]
[]
[]
[]
[]
[]
[]
[]
[]
[]
[]
[]
[]
[]
[]
[]
[]
[]
[]
[]
[]
[]
[]
[]
[]
[]
[]
[]
[]
[]
[]
[]
[]
[]
[]
[]
[]
[]
[]
[]
[]
[]
[]
[]
[]
[]
[]
[]
[]
[]
[]
[null,"Transport"]
[]
[null,null,null,"Lijst_Dim_Transport_Laadvermogen",null,"Lijst_Brandstof_Soort",null,null,"Lijst_Brandstof_RHO_kgm3","Lijst_Brandstof_LHV_GJm3"]
[null,null,"Nr","Dimensie",null,"Brandstof",null,null,"Dichtheid\nkg/m3","LHV\nGJ/m3"]
[null,null,1,null,null,"Aardgas - CNG",null,null,999,99]
[null,null,2,null,null,"Benzine ",null,null,745.45454545454538,32.799999999999997]
[null,null,null,null,null,"Bio-diesel - gemiddeld",null,null,880,32]
[null,null,null,null,null,"Bio-diesel uit afval",null,null,880,32]
[null,null,null,null,null,"Bio-diesel uit palmolie",null,null,880,32]
[null,null,null,null,null,"Bio-diesel uit soja",null,null,880,32]
[null,null,null,null,null,"Bio-diesel uit zonnebloemen",null,null,880,32]
[null,null,null,null,null,"Bio-ethanol - gemiddeld",null,null,745.45454545454538,32.799999999999997]
[null,null,null,null,null,"Bio-ethanol uit graan",null,null,745.45454545454538,32.799999999999997]
[null,null,null,null,null,"Bio-ethanol uit stro",null,null,745.45454545454538,32.799999999999997]
[null,null,null,null,null,"Bio-ethanol uit suikerbieten",null,null,745.45454545454538,32.799999999999997]
[null,null,null,null,null,"Bio-ethanol uit suikerriet",null,null,745.45454545454538,32.799999999999997]
[null,null,null,null,null,"Biogas",null,null,999,99]
[null,null,null,null,null,"Diesel",null,null,840.74941451990628,35.9]
[null,null,null,null,null,"Koolzaadolie",null,null,880,32]
[null,null,null,null,null,"LPG",null,null,539.64757709251103,24.5]
[null,null,null,null,null,"Waterstof",null,null,999,99]
[]
[]
[]
[null,null,"Lijst_Dim_Brandstof_Verbruik",null,null,"Lijst_Dim_Brandstof_Verbruik"]
[null,null,"Nr","Unit",null,"Nr","Unit"]
[null,null,1,null,null,1]
[null,null,2,null,null,2]
[null,null,3,null,null,3]
[null,null,4,null,null,4]
[null,null,5,null,null,5]
[null,null,6,null,null,6]
[null,null,7,null,null,7]
[null,null,8,null,null,8]
[null,null,9]
[null,null,10]
[null,null,11,null,null,null,null,null,null,null,null,null,null,null,null,null,null,null,null,null,null,null,null,null,null,null,null,"Lijst_Dim_CO2_Doorzet"]
[null,null,12,null,null,null,null,null,null,null,null,null,null,null,null,null,null,null,null,null,null,null,null,null,null,"Dimensie",null,"Nr","Dimensie"]
[null,null,null,null,null,null,null,null,null,null,null,null,null,null,null,null,null,null,null,null,null,null,null,null,null,"kg",null,1,"kg"]
[null,null,null,null,null,null,null,null,null,null,null,null,null,null,null,null,null,null,null,null,null,null,null,null,null,"ton",null,2,"kg/GJ"]
[null,null,null,null,null,null,null,null,null,null,null,null,null,null,null,null,null,null,null,null,null,null,null,null,null,null,null,null,"kg/ha"]
[null,null,null,null,null,null,null,null,null,null,null,null,null,null,null,null,null,null,null,null,null,null,null,null,null,null,null,null,"kg/m3"]
[null,null,null,null,null,null,null,null,null,null,null,null,null,null,null,null,null,null,null,null,null,null,null,null,null,null,null,null,"kg/MWh"]
[null,null,null,null,null,null,"kg",null,null,null,null,null,null,null,null,null,null,null,null,null,null,null,null,null,null,null,null,null,"kg/ton"]
[null,null,null,null,null,null,"ton",null,null,null,null,null,null,null,null,null,null,null,null,null,null,null,null,null,null,null,null,null,"kg/tonds"]
[null,null,null,null,null,null,null,null,null,null,null,null,null,null,null,null,null,null,null,null,null,null,null,null,null,null,null,null,"ton"]
[]
[]
[]
[]
[null,null,"Lijst_Dim_Euro_Doorzet",null,null,"Lijst_Dim_Euro_CO2",null,null,null,null,null,null,null,null,null,null,null,null,null,null,null,null,null,null,null,null,null,"Lijst"]
[null,null,"Nr","Unit",null,"Nr","Unit",null,null,null,null,null,null,null,null,null,null,null,null,null,null,null,null,null,null,"Dimensie",null,"Arbeid"]
[null,null,1,"€",null,1,"€",null,null,null,null,null,null,null,null,null,null,null,null,null,null,null,null,null,null,"FTE",null,"Tijd"]
[null,null,2,"€/m3",null,4,"€/ton",null,null,null,null,null,null,null,null,null,null,null,null,null,null,null,null,null,null,"uur"]
[null,null,6,"€/ton",null,null,"€/m3",null,null,null,null,null,null,null,null,null,null,null,null,null,null,null,null,null,null,"m3/uur",null,"FTE"]
[null,null,7,"€/tonds",null,null,"€/GJ",null,null,null,null,null,null,null,null,null,null,null,null,null,null,null,null,null,null,"ha/uur",null,"GJ/uur","GJ/uur"]
[null,null,8,"€/GJ",null,null,"€/MWh",null,null,null,null,null,null,null,null,null,null,null,null,null,null,null,null,null,null,"ton/uur",null,"ha/uur","ha/uur"]
[null,null,9,"€/MWh",null,null,null,null,null,null,null,null,null,null,null,null,null,null,null,null,null,null,null,null,null,"tonds/uur",null,"m3/uur","m3/uur"]
[null,null,null,null,null,null,null,null,null,null,null,null,null,null,null,null,null,null,null,null,null,null,null,null,null,"GJ/uur",null,"MWh/uur","MWh/uur"]
[null,null,null,null,null,null,null,null,null,null,null,null,null,null,null,null,null,null,null,null,null,null,null,null,null,"MWh/uur",null,"ton/uur","ton/uur"]
[null,null,null,null,null,null,null,null,null,null,null,null,null,null,null,null,null,null,null,null,null,null,null,null,null,"uur/m3",null,"tonds/uur","tonds/uur"]
[null,null,null,null,null,null,null,null,null,null,null,null,null,null,null,null,null,null,null,null,null,null,null,null,null,"uur/ha",null,"uur","uur"]
[null,null,null,null,null,"Lijst_Dim_Hout_Opbrengst",null,null,"Lijst_Dim_Stroomkosten",null,null,null,null,null,null,null,null,null,null,null,null,null,null,null,null,"uur/ton",null,"uur/GJ","uur/GJ"]
[null,null,null,null,null,"Nr","Dimensie",null,"Nr","Dimensie",null,null,null,null,null,null,null,null,null,null,null,null,null,null,null,"uur/tonds",null,"uur/ha","uur/ha"]
[null,null,null,null,null,1,"m3/ha",null,1,"€",null,null,null,null,null,null,null,null,null,null,null,null,null,null,null,"uur/GJ",null,"uur/m3","uur/m3"]
[null,null,null,null,null,2,"ton/ha",null,null,"€/kWh",null,null,null,null,null,null,null,null,null,null,null,null,null,null,null,"uur/MWh",null,"uur/MWh","uur/MWh"]
[null,null,null,null,null,3,"tonds/ha",null,null,"€/MWh",null,null,null,null,null,null,null,null,null,null,null,null,null,null,null,null,null,"uur/ton","uur/ton"]
[null,null,null,null,null,4,"GJ/ha",null,null,null,null,null,null,null,null,null,null,null,null,null,null,null,null,null,null,null,null,"uur/tonds","uur/tonds"]
[null,null,null,null,null,5,"MWh/ha"]
[null,null,null,null,null,6,"kWh/ha"]

{"sheet":"Ketens-Berekend","index":12,"n_rows":50,"n_cols":100,"rows_kept":50,"cut":false,"hidden":true,"merged":[[18,1,25,1],[5,6,5,10],[16,6,16,10],[7,1,14,1]]}
[]
[null,null,null,"Invoer",null,null,{"$f":"VLOOKUP(C2,Lijst_NL_Keten,2)","v":{"$error":"#N/A"}}]
[]
[null,null,1,{"$f":"C4+1","v":2},{"$f":"D4+1","v":3},{"$f":"E4+1","v":4},{"$f":"F4+1","v":5},{"$f":"G4+1","v":6},7,8,9,10,11,12,13,14,15,16,17,18,19,20,21,22,23,24,25,26,27,28,29,30,31,32,33,34,35,36,37,38,39,40,41,42,43,44,45,46,47,48,49,50,51,52,53,54,55,56,57,58,59,60,61,62,63,64,65,66,67,68,69,{"$f":"BS4+1","v":70},71,72,73,74,75,76,77,78,79,80,81,82,83,84,85,86,87]
[null,{"$f":"ROW()","v":5},null,null,"Ketens EU en NL",null,null,null,null,null,null,null,1,{"$f":"\"Ketenstap-\"&M5","v":"Ketenstap-1"},null,null,null,null,null,null,null,null,null,{"$f":"M5+1","v":2},{"$f":"\"Ketenstap-\"&X5","v":"Ketenstap-2"},null,null,null,null,null,null,null,null,null,{"$f":"X5+1","v":3},{"$f":"\"Ketenstap-\"&AI5","v":"Ketenstap-3"},null,null,null,null,null,null,null,null,null,{"$f":"AI5+1","v":4},{"$f":"\"Ketenstap-\"&AT5","v":"Ketenstap-4"},null,null,null,null,null,null,null,null,null,{"$f":"AT5+1","v":5},{"$f":"\"Ketenstap-\"&BE5","v":"Ketenstap-5"},null,null,null,null,null,null,null,null,null,{"$f":"BE5+1","v":6},{"$f":"\"Ketenstap-\"&BP5","v":"Ketenstap-6"},null,null,null,null,null,null,null,null,null,{"$f":"BP5+1","v":7},{"$f":"\"Ketenstap-\"&CA5","v":"Ketenstap-7"}]
[null,null,null,null,null,null,"Broeikasgassen in gCO2eq/MJ - EU",null,null,null,null,null,{"$f":"N5","v":"Ketenstap-1"},{"$f":"N5","v":"Ketenstap-1"},null,"Doorzet","Doorzet","Vochtigheid","Diesel","CO2","CH4","N2O","CO2eq",{"$f":"Y5","v":"Ketenstap-2"},{"$f":"Y5","v":"Ketenstap-2"},null,"Doorzet","Doorzet","Vochtigheid","Diesel","CO2","CH4","N2O","CO2eq",{"$f":"AJ5","v":"Ketenstap-3"},{"$f":"AJ5","v":"Ketenstap-3"},null,"Doorzet","Doorzet","Vochtigheid","Diesel","CO2","CH4","N2O","CO2eq",{"$f":"AU5","v":"Ketenstap-4"},{"$f":"AU5","v":"Ketenstap-4"},"Stap2","Doorzet","Doorzet","Vochtigheid","Diesel","CO2","CH4","N2O","CO2eq",{"$f":"BF5","v":"Ketenstap-5"},{"$f":"BF5","v":"Ketenstap-5"},null,"Doorzet","Doorzet","Vochtigheid","Diesel","CO2","CH4","N2O","CO2eq",{"$f":"BQ5","v":"Ketenstap-6"},{"$f":"BQ5","v":"Ketenstap-6"},null,"Doorzet","Doorzet","Vochtigheid","Diesel","CO2","CH4","N2O","CO2eq",{"$f":"CB5","v":"Ketenstap-7"},{"$f":"CB5","v":"Ketenstap-7"},null,"Doorzet","Doorzet","Vochtigheid","Diesel","CO2","CH4","N2O","CO2eq"]
[null,null,"Nr + NL-Titel","NL/EU","Nr","NL-Titel","Cultivatie","Proces","Transport","Verbranding","Totaal","Stappen","Titel-kort","Detailinformatie","C/P/T","MJout/MJin","MJin","%","MJ/MJdoorzet","g/MJ","g/MJ","g/MJ","g/MJ","Titel-kort","Detailinformatie","P/T","MJout/MJin","MJin","%","MJ/MJdoorzet","g/MJ","g/MJ","g/MJ","g/MJ","Titel-kort","Detailinformatie","C/P/T","MJout/MJin","MJout","%","MJ/MJdoorzet","g/MJ","g/MJ","g/MJ","g/MJ","Titel-kort","Detailinformatie","P/T","MJout/MJin","MJout","%","MJ/MJdoorzet","g/MJ","g/MJ","g/MJ","g/MJ","Titel-kort","Detailinformatie","C/P/T","MJout/MJin","MJout","%","MJ/MJdoorzet","g/MJ","g/MJ","g/MJ","g/MJ","Titel-kort","Detailinformatie","P/T","MJout/MJin","MJout","%","MJ/MJdoorzet","g/MJ","g/MJ","g/MJ","g/MJ","Titel-kort","Detailinformatie","C/P/T","MJout/MJin","MJout","%","MJ/MJdoorzet","g/MJ","g/MJ","g/MJ","g/MJ",null,null,null,null,"Titel","Stap1","Stap2","Stap3","Stap4","Stap5","Stap6"]
[null,"NL",{"$f":"E8&\"-\"&F8","v":"1a-Chips uit top- en tak hout uit bos of landschap"},"EU-NL","1a","Chips uit top- en tak hout uit bos of landschap",0,1.5164366759002779,0.89013599999999993,0.41358188387,{"$f":"SUM(G8:I8)","v":2.4065726759002777},{"$f":"IF(M8=\"\",0,IF(X8=\"\",1,IF(AI8=\"\",2,IF(AT8=\"\",3,IF(BE8=\"\",4,IF(BP8=\"\",5,6))))))","v":4},"Inzamelen top- en takhout","Bundelen en stobben oogsten is geen gebruikelijk praktijk in NL. Uitrijden varieert - afhankelijk van de situatie - tussen ca. 1 en 2 liter per verse ton. Het conservatief  gemiddelde op basis van de gegevens van de partijen uit de keten in NL wordt gesteld op ca. 2 liter per verse ton. Dit is ca. 4 liter per ton droge stof. Een aantal bedrijven in Nederland chippen in het bos, en rijden met trekker en dumper uit naar het bospad. Dit scenario is in dit project niet beschreven.","P",1,{"$f":"AB8*P8","v":1.0789473684210524},50,7.5789473684210523E-3,{"$f":"S8*JRC_Basis_Diesel_CO2*Q8","v":0.76823324099722956},0,0,0.77894736842105305,"Drogen langs de weg","Meestal wordt niet gedroogd langs de weg en vrijwel direct gechipt en met een vochtigheid (M45) aan de klant geleverd. \nDoor de kortere opslagtijd zal het verlies in NL minder zijn.  Voor het gemak is dezelfde waarde voor verlies aangehouden voor NL, als bij JRC.\n     \n     \n     \n\n\n","P",1.0526315789473684,{"$f":"AM8*AA8","v":1.0789473684210524},null,null,null,null,null,0,"Chippen","In Nederland wordt vooral met diesel gechipt. Dieselverbruik is ca. 1,5 l/ton vers. De berekening gaat uit van een conservatief gemiddelde: 2 l/ton vers, en een verlies als in de EU. \n           \n           \n           \n           \n           \n           \n           \n           \n           \n           \n           \n           \n","P",1.0249999999999999,{"$f":"AX8*AL8","v":1.0249999999999999},50,null,null,null,null,0.73684210526315785,"Transport chips naar afnemer","De vochtigheid van de NL chips is aangenomen op 45 %. De verste gemiddelde straal tot de afnemer bij de in het project betrokken partijen in de houtketen is 120 km voor NL chips. Om de waarde 'conservatief' te houden is deze afstand opgehoogd naar 150 km. Voor een truck van 40 ton, payload 27 ton chips is het verbruik diesel is 30,53 liter per 100 km (dataset JRC 2017).  Met vochtigheid M45 is dit 14,8 ton droge stof.  Conservatief gemiddelde voor de loadfactor is 50 % (=lege terugreis).Verbruik diesel is 30,53 liter/14,8 ton droge stof *2*1,5= 6,19 liter/ton droge stof/150 km. ","T",1,1,null,null,null,null,null,0.88947368421052619,null,null,null,null,{"$f":"BS8*BH8","v":0},50,null,null,null,null,0,null,null,null,{"$f":"CE8*BT8","v":1},1,null,null,null,null,null,0,null,null,null,1,1,null,null,null,null,null,null,null,null,null,null,{"$f":"C8","v":"1a-Chips uit top- en tak hout uit bos of landschap"},{"$f":"N8","v":"Bundelen en stobben oogsten is geen gebruikelijk praktijk in NL. Uitrijden varieert - afhankelijk van de situatie - tussen ca. 1 en 2 liter per verse ton. Het conservatief  gemiddelde op basis van de gegevens van de partijen uit de keten in NL wordt gesteld op ca. 2 liter per verse ton. Dit is ca. 4 liter per ton droge stof. Een aantal bedrijven in Nederland chippen in het bos, en rijden met trekker en dumper uit naar het bospad. Dit scenario is in dit project niet beschreven."},{"$f":"Y8","v":"Meestal wordt niet gedroogd langs de weg en vrijwel direct gechipt en met een vochtigheid (M45) aan de klant geleverd. \nDoor de kortere opslagtijd zal het verlies in NL minder zijn.  Voor het gemak is dezelfde waarde voor verlies aangehouden voor NL, als bij JRC.\n     \n     \n     \n\n\n"},{"$f":"AJ8","v":"In Nederland wordt vooral met diesel gechipt. Dieselverbruik is ca. 1,5 l/ton vers. De berekening gaat uit van een conservatief gemiddelde: 2 l/ton vers, en een verlies als in de EU. \n           \n           \n           \n           \n           \n           \n           \n           \n           \n           \n           \n           \n"},{"$f":"AU8","v":"De vochtigheid van de NL chips is aangenomen op 45 %. De verste gemiddelde straal tot de afnemer bij de in het project betrokken partijen in de houtketen is 120 km voor NL chips. Om de waarde 'conservatief' te houden is deze afstand opgehoogd naar 150 km. Voor een truck van 40 ton, payload 27 ton chips is het verbruik diesel is 30,53 liter per 100 km (dataset JRC 2017).  Met vochtigheid M45 is dit 14,8 ton droge stof.  Conservatief gemiddelde voor de loadfactor is 50 % (=lege terugreis).Verbruik diesel is 30,53 liter/14,8 ton droge stof *2*1,5= 6,19 liter/ton droge stof/150 km. "}]
[null,null,"2a-Chips uit rondhout uit bos of landschap","EU-NL","2a","Chips uit rondhout uit bos of landschap",1.0938001578947383,0.55408263157894722,1.3295138060941833,0.41358188387,1,5,"Teelt rondhout","De ‘typische’ praktijk in NL verschilt. Er is vaak natuurlijke verjonging en nauwelijks bemesting. Deze berekenen is niet haalbaar voor deze opdracht. De EU waarde wordt hier gebruikt.","C",1,null,null,1.0659999999999999E-2,{"$f":"S9*JRC_Basis_Diesel_CO2","v":1.0014773888888886},0,0,1.0947368421052632,"Transport naar centrale opslag","Transport is in een straal van maximaal 50 km met een rondhout vrachtwagen met 40 ton vers laadvermogen. De terugrit is leeg. Gerekend is met de maximale heen én terugrit.","T",1,1,null,2.89894736842105E-3,{"$f":"AD9*JRC_Basis_Diesel_CO2","v":0.27234805263157869},null,null,0.43684210526315792,"Drogen op centrale opslag ","De EU-waarde is aangehouden.","P","1.05",{"$f":"AX9*AL9","v":{"$error":"#VALUE!"}},null,null,null,null,null,0,"Chippen","In Nederland wordt vooral met diesel gechipt. Dieselverbruik is ca. 1,5 l/ton vers. De berekening gaat uit van een conservatief gemiddelde: 2 l/ton vers (= 4 l/ton ds), en een verlies als in EU. \n           \n           \n           \n           \n           \n           \n           \n           \n           \n           \n           \n           \n","P",1.0249999999999999,null,null,null,null,null,null,0.55263157894736847,"Transport chips naar afnemer","Transport is in een straal van maximaal 120 km met een walkingfloor trailer of 2 containers (27 ton laadvermogen). De terugrit is leeg. Gerekend is voor de maximale heen én terugrit.","T",1,{"$f":"BS9*BH9","v":0},null,null,null,null,null,0.88947368421052619,null,null,null,null,null,null,null,null,null,null,0,null,null,null,null,null,null,null,null,null,null,null,null,null,null,null,"2a-Chips uit rondhout uit bos of landschap","De ‘typische’ praktijk in NL verschilt. Er is vaak natuurlijke verjonging en nauwelijks bemesting. Deze berekenen is niet haalbaar voor deze opdracht. De EU waarde wordt hier gebruikt.","Transport is in een straal van maximaal 50 km met een rondhout vrachtwagen met 40 ton vers laadvermogen. De terugrit is leeg. Gerekend is met de maximale heen én terugrit.","De EU-waarde is aangehouden.",{"$f":"AU9","v":"In Nederland wordt vooral met diesel gechipt. Dieselverbruik is ca. 1,5 l/ton vers. De berekening gaat uit van een conservatief gemiddelde: 2 l/ton vers (= 4 l/ton ds), en een verlies als in EU. \n           \n           \n           \n           \n           \n           \n           \n           \n           \n           \n           \n           \n"}]
[null,null,"2b-Pellets uit (vers) rondhout uit bos of landschap","EU-NL","2b","Pellets uit (vers) rondhout uit bos of landschap",1.0495012515,21.571372511680533,1.9539683460000001,0.251214539475,0,6,"Teelt rondhout","De ‘typische’ praktijk in NL verschilt. Er is vaak natuurlijke verjonging en nauwelijks bemesting. Deze berekenen is niet haalbaar voor deze opdracht. De EU waarde wordt hier gebruikt.","C",1,null,null,1.0659999999999999E-2,1.0014773888888886,0,0,1.0473684210526315,"Transport naar centrale opslag","Transport is in een straal van maximaal 50 km met een rondhout vrachtwagen met 40 ton vers laadvermogen. De terugrit is leeg. Gerekend is met de maximale heen én terugrit.","T",1,null,null,2.89894736842105E-3,null,null,null,0.42105263157894735,"Chippen","In Nederland wordt vooral met diesel gechipt. Dieselverbruik is ca. 1,5 l/ton vers. De berekening gaat uit van een conservatief gemiddelde: 2 l/ton vers (= 4 l/ton ds), en een verlies als in EU. ","P",null,null,null,null,null,null,null,0.55789473684210522,"Transport chips naar fabriek","Transport is in een straal van maximaal 120 km met een walkingfloor trailer of 2 containers (27 ton laadvermogen). De terugrit is leeg. Gerekend is voor de maximale heen én terugrit.","T",null,null,null,null,null,null,null,0.98947368421052639,"Drogen, verkleinen, pelletiseren","Zie beschrijving EU. De elektriciteit nodig voor de pelletpers en andere processen komt van het NL-elektriciteitsnet. Emissiefactor stroom is gemiddelde NL, zie BioGrace-II. ","P",null,null,null,null,null,null,null,21.010526315789473,"Transport pellets naar afnemer","Transport is in een straal van maximaal 150 km met een walkingfloor trailer of 2 containers (27 ton laadvermogen). De terugrit is leeg. Gerekend is voor de maximale heen én terugrit.","T",null,null,null,null,null,null,null,0.54210526315789476,null,null,null,null,null,null,null,null,null,null,null,null,null,null,null,"2b-Pellets uit (vers) rondhout uit bos of landschap","De ‘typische’ praktijk in NL verschilt. Er is vaak natuurlijke verjonging en nauwelijks bemesting. Deze berekenen is niet haalbaar voor deze opdracht. De EU waarde wordt hier gebruikt.","Transport is in een straal van maximaal 50 km met een rondhout vrachtwagen met 40 ton vers laadvermogen. De terugrit is leeg. Gerekend is met de maximale heen én terugrit.","In Nederland wordt vooral met diesel gechipt. Dieselverbruik is ca. 1,5 l/ton vers. De berekening gaat uit van een conservatief gemiddelde: 2 l/ton vers (= 4 l/ton ds), en een verlies als in EU. ","Transport is in een straal van maximaal 120 km met een walkingfloor trailer of 2 containers (27 ton laadvermogen). De terugrit is leeg. Gerekend is voor de maximale heen én terugrit."]
[null,null,"2c-Blokken uit rondhout uit bos of landschap","NL","2c","Blokken uit rondhout uit bos of landschap",1.0671221052631594,1.3514210526315789,1.3656465373961222,0.41358188387,4,5,"Teelt rondhout","De ‘typische’ praktijk in NL verschilt. Er is vaak natuurlijke verjonging en nauwelijks bemesting. Deze berekenen is niet haalbaar voor deze opdracht. De EU waarde wordt hier gebruikt.","C",1,null,null,1.0659999999999999E-2,1.0014773888888886,0,0,1.0684210526315789,"Transport naar centrale opslag","Transport is in een straal van maximaal 50 km met een rondhout vrachtwagen met 40 ton vers laadvermogen. De terugrit is leeg. Gerekend is met de maximale heen én terugrit.","T",1,null,null,2.89894736842105E-3,null,null,null,0.4263157894736842,"Afkorten en kloven","De stammen worden afgekort en gekloofd. Het dieselverbruik is 1,2 liter diesel per m3 blokken losgestort. Gerekend is met de houtdichtheid van de gemiddelde samenstelling van het NL bos.","P",null,null,null,null,null,null,null,1.3526315789473684,"Drogen op centrale opslag","De vochtigheid (M) neemt af van 50 naar 15 à 20 %, verder is de EU-waarde is aangehouden.","P",null,null,null,null,null,null,null,0,"Transport naar de afnemer","De gemiddelde straal in NL voor afnemers van NL houtblokken is in de regio en maximaal 30 km. We gaan uit van een trekker met kiepkap, laadvermogen 18 m3 blokken losgestort, diesel verbruik 25 liter/100km. Gerekend is met de standaard houtdichtheid JRC/Biograce van fijnspar. Een lege terugrit is meegeteld.","T",null,null,null,null,null,null,null,0.93684210526315792,null,null,null,null,null,null,null,null,null,null,0,null,null,null,null,null,null,null,null,null,null,null,null,null,null,null,"2c-Blokken uit rondhout uit bos of landschap","De ‘typische’ praktijk in NL verschilt. Er is vaak natuurlijke verjonging en nauwelijks bemesting. Deze berekenen is niet haalbaar voor deze opdracht. De EU waarde wordt hier gebruikt.","Transport is in een straal van maximaal 50 km met een rondhout vrachtwagen met 40 ton vers laadvermogen. De terugrit is leeg. Gerekend is met de maximale heen én terugrit.","De stammen worden afgekort en gekloofd. Het dieselverbruik is 1,2 liter diesel per m3 blokken losgestort. Gerekend is met de houtdichtheid van de gemiddelde samenstelling van het NL bos.","De vochtigheid (M) neemt af van 50 naar 15 à 20 %, verder is de EU-waarde is aangehouden."]
[null,null,"3a-Chips uit reststromen houtindustrie","EU-NL","3a","Chips uit reststromen houtindustrie",0,0.55408263157894722,0.89013599999999993,0.41358188387,3,2,"Chippen  ","In Nederland worden reststromen uit de houtindustrie zowel elektrisch als met diesel gechipt. Het is vers hout van zagerijen, of droog A-hout. Dezelfde waarden als EU worden gevolgd.","P",null,null,null,3.3570000000000002E-3,0.31538082499999998,0,0,0.55263157894736847,"Transport chips naar de afnemer","Transport is in een straal van maximaal 120 km met een walkingfloor trailer of 2 containers (27 ton laadvermogen). De terugrit is leeg. Gerekend is met de maximale heen- én terugrit.","T",1,null,null,9.3600000000000003E-3,null,null,null,0.88947368421052619,null,null,null,null,null,null,null,null,null,null,0,null,null,null,null,null,null,null,null,null,null,0,null,null,null,null,null,null,null,null,null,null,0,null,null,null,null,null,null,null,null,null,null,0,null,null,null,null,null,null,null,null,null,null,null,null,null,null,null,"3a-Chips uit reststromen houtindustrie","In Nederland worden reststromen uit de houtindustrie zowel elektrisch als met diesel gechipt. Het is vers hout van zagerijen, of droog A-hout. Dezelfde waarden als EU worden gevolgd.","Transport is in een straal van maximaal 120 km met een walkingfloor trailer of 2 containers (27 ton laadvermogen). De terugrit is leeg. Gerekend is met de maximale heen- én terugrit.",0,0]
[null,null,"3b-Pellets uit (droge) reststromen houtindustrie","EU-NL","3b","Pellets uit (droge) reststromen houtindustrie",0,5.888926553500001,1.3376545768421051,0.251214539475,5,3,"Transport naar Pelletfabriek","Transport zaagsel en schaafsel (M10) vanuit een straal van maximaal 90 km met walkingfloor trailer of 2 containers (27 ton laadvermogen). Gerekend is voor de maximale heen én terugrit. ","T",1,null,null,8.2610526315789485E-3,0.776102947368421,0,0,0.79473684210526319,"Drogen, verkleinen, pelletiseren","Proces vergelijkbaar met EU. Stroom nodig voor het malen en pelletpers bij de partijen in de houtketen in NL is 190 kWh/ton. Emissiefactor stroom is van gemiddelde NL, zie BioGrace-II. ","P",1.0101010101010102,null,null,1E-3,null,null,null,6.310526315789474,"Transport pellets naar afnemer","Transport is in een straal van maximaal 120 km met een walkingfloor trailer of 2 containers (27 ton laadvermogen). De terugrit is leeg. Gerekend is voor de maximale heen én terugrit.","T",null,null,null,null,null,null,null,0.54210526315789476,null,null,null,null,null,null,null,null,null,null,0,null,null,null,null,null,null,null,null,null,null,0,null,null,null,null,null,null,null,null,null,null,0,null,null,null,null,null,null,null,null,null,null,null,null,null,null,null,"3b-Pellets uit (droge) reststromen houtindustrie","Transport zaagsel en schaafsel (M10) vanuit een straal van maximaal 90 km met walkingfloor trailer of 2 containers (27 ton laadvermogen). Gerekend is voor de maximale heen én terugrit. ","Proces vergelijkbaar met EU. Stroom nodig voor het malen en pelletpers bij de partijen in de houtketen in NL is 190 kWh/ton. Emissiefactor stroom is van gemiddelde NL, zie BioGrace-II. ","Transport is in een straal van maximaal 120 km met een walkingfloor trailer of 2 containers (27 ton laadvermogen). De terugrit is leeg. Gerekend is voor de maximale heen én terugrit.",0]
[null,null,"4a-Shreds uit groene reststromen","NL","4a","Shreds uit groene reststromen",0,0.54056842105263148,1.6293870249307487,0.41358188387,7,4,"Inzamelen groene reststromen","Het inzamelen van groene reststroom uit tuin-, groen-, weg- en landschapsonderhoud is in een straal van maximaal 60 km. Gerekend is met 27 ton laadvermogen. De terugreis is leeg.","T",1,null,null,5.1347368421052631E-3,0.48239426315789469,0,0,0.51578947368421058,"Opslag en drogen","Het hout wordt kort opgeslagen en droogt tot een vochtigheid van ca. 45 % (M45). Aanname is een verlies aan droge stof van 5 %, vergelijkbaar met de EU-keten voor top- en takhout uit het bos.","P",1.0526315789473684,null,null,null,null,null,null,0,"Shredderen en zeven (+laden)","Het grover hout (stronken en takken) wordt geshredderd en het zand en fijn materiaal wordt eruit gezeefd en ingezet voor andere producten. Dieselverbruik is circa 1,5 liter/ton vers M45. \n           \n           \n           ","P",null,null,null,null,null,null,null,0.54210526315789476,"Transport shreds naar afnemer","Transport is in een straal van maximaal 150 km met een walkingfloor trailer of 2 containers (27 ton laadvermogen). Gerekend is dieselverbruik voor de maximale straal én terugrit.",null,null,null,null,null,null,null,null,0,null,null,null,null,null,null,null,null,null,null,0,null,null,null,null,null,null,null,null,null,null,0,null,null,null,null,null,null,null,null,null,null,null,null,null,null,null,"4a-Shreds uit groene reststromen","Het inzamelen van groene reststroom uit tuin-, groen-, weg- en landschapsonderhoud is in een straal van maximaal 60 km. Gerekend is met 27 ton laadvermogen. De terugreis is leeg.","Het hout wordt kort opgeslagen en droogt tot een vochtigheid van ca. 45 % (M45). Aanname is een verlies aan droge stof van 5 %, vergelijkbaar met de EU-keten voor top- en takhout uit het bos.","Het grover hout (stronken en takken) wordt geshredderd en het zand en fijn materiaal wordt eruit gezeefd en ingezet voor andere producten. Dieselverbruik is circa 1,5 liter/ton vers M45. \n           \n           \n           ","Transport is in een straal van maximaal 150 km met een walkingfloor trailer of 2 containers (27 ton laadvermogen). Gerekend is dieselverbruik voor de maximale straal én terugrit."]
[null,null,"4b-Shreds uit zeefoverloop","NL","4b","Shreds uit zeefoverloop",0,1.7017894719824209,1.6864997113402314,0.41358188387,8,5,"Inzamelen groene reststromen","Het inzamelen van groene reststroom uit tuin-, groen-, weg- en landschapsonderhoud is in een straal van maximaal 60 km. Gerekend is met 27 ton laadvermogen. De terugreis is leeg.","T",1,null,null,5.1347368421052631E-3,0.48239426315789469,0,0,0.5736842105263158,"Opslag en drogen","Het hout wordt kort opgeslagen en droogt tot een vochtigheid van ca. 45 % (M45). Aanname is een verlies aan droge stof van 5 %, vergelijkbaar met de EU-keten voor top- en takhout uit het bos.","P",1.0526315789473684,null,null,null,null,null,null,0,"Shredderen en zeven (+laden)","Het grover hout (stronken en takken) wordt geshredderd en gezeefd in verschillende fracties voor verdere verwerking. Dieselverbruik is circa 1,5 liter/ton vers M45. \n           \n           \n           ","P",null,null,null,null,null,null,null,0.6,"Composteren en uitzeven shreds","Dit is inclusief op rillen zetten, omzetten, zeven en laden. De shreds worden uiteindelijk uit de compost gezeefd. Verbruik aan diesel: 5,5 liter per verse ton M45. Verlies aan droge massa: 10 %.      \n           \n           ","P",null,null,null,null,null,null,null,1.0999999999999999,"Transport shreds naar de afnemer","Transport is in een straal van maximaal 150 km met een walkingfloor trailer of 2 containers (27 ton laadvermogen). Gerekend is voor de maximale heen én terugrit.","T",null,null,null,null,null,null,null,null,null,null,null,null,null,null,null,null,null,null,null,null,null,null,null,null,null,null,null,null,null,null,null,null,null,null,"4b-Shreds uit zeefoverloop","Het inzamelen van groene reststroom uit tuin-, groen-, weg- en landschapsonderhoud is in een straal van maximaal 60 km. Gerekend is met 27 ton laadvermogen. De terugreis is leeg.","Het hout wordt kort opgeslagen en droogt tot een vochtigheid van ca. 45 % (M45). Aanname is een verlies aan droge stof van 5 %, vergelijkbaar met de EU-keten voor top- en takhout uit het bos.","Het grover hout (stronken en takken) wordt geshredderd en gezeefd in verschillende fracties voor verdere verwerking. Dieselverbruik is circa 1,5 liter/ton vers M45. \n           \n           \n           ","Dit is inclusief op rillen zetten, omzetten, zeven en laden. De shreds worden uiteindelijk uit de compost gezeefd. Verbruik aan diesel: 5,5 liter per verse ton M45. Verlies aan droge massa: 10 %.      \n           \n           "]
[null,null,null,null,null,null,{"$f":"SUM(G8:G15)","v":3.2104235146578977},{"$f":"SUM(H8:H15)","v":33.678679949905344},{"$f":"SUM(I8:I15)","v":11.08294200260339},{"$f":"SUM(J8:J15)","v":2.98392038217},{"$f":"SUM(K8:K15)","v":30.406572675900279}]
[null,null,null,null,null,null,"Broeikasgassen in gCO2eq/MJ - EU",null,null,null,null,null,{"$f":"N5","v":"Ketenstap-1"},{"$f":"N5","v":"Ketenstap-1"},null,"Doorzet","Doorzet","Vochtigheid","Diesel","CO2","CH4","N2O","CO2eq",{"$f":"Y5","v":"Ketenstap-2"},{"$f":"Y5","v":"Ketenstap-2"},null,"Doorzet","Doorzet","Vochtigheid","Diesel","CO2","CH4","N2O","CO2eq",{"$f":"AJ5","v":"Ketenstap-3"},{"$f":"AJ5","v":"Ketenstap-3"},null,"Doorzet","Doorzet","Vochtigheid","Diesel","CO2","CH4","N2O","CO2eq",{"$f":"AU5","v":"Ketenstap-4"},{"$f":"AU5","v":"Ketenstap-4"},null,"Doorzet","Doorzet","Vochtigheid","Diesel","CO2","CH4","N2O","CO2eq",{"$f":"BF5","v":"Ketenstap-5"},{"$f":"BF5","v":"Ketenstap-5"},null,"Doorzet","Doorzet","Vochtigheid","Diesel","CO2","CH4","N2O","CO2eq",{"$f":"BQ5","v":"Ketenstap-6"},{"$f":"BQ5","v":"Ketenstap-6"},null,"Doorzet","Doorzet","Vochtigheid","Diesel","CO2","CH4","N2O","CO2eq",{"$f":"CB5","v":"Ketenstap-7"},{"$f":"CB5","v":"Ketenstap-7"},null,"Doorzet","Doorzet","Vochtigheid","Diesel","CO2","CH4","N2O","CO2eq"]
[null,null,"Nr + EU-Titel","NL/EU","Nr","EU-Titel","Cultivation","Proces","Transport","Combustion","Total",null,"Titel-kort","Detailinformatie","C/P/T","MJout/MJin","MJin","%","MJ/MJdoorzet","g/MJ","g/MJ","g/MJ","g/MJ","Titel-kort","Detailinformatie","P/T","MJout/MJin","MJin","%","MJ/MJdoorzet","g/MJ","g/MJ","g/MJ","g/MJ","Titel-kort","Detailinformatie","C/P/T","MJout/MJin","MJout","%","MJ/MJdoorzet","g/MJ","g/MJ","g/MJ","g/MJ","Titel-kort","Detailinformatie","P/T","MJout/MJin","MJout","%","MJ/MJdoorzet","g/MJ","g/MJ","g/MJ","g/MJ","Titel-kort","Detailinformatie","C/P/T","MJout/MJin","MJout","%","MJ/MJdoorzet","g/MJ","g/MJ","g/MJ","g/MJ","Titel-kort","Detailinformatie","P/T","MJout/MJin","MJout","%","MJ/MJdoorzet","g/MJ","g/MJ","g/MJ","g/MJ","Titel-kort","Detailinformatie","C/P/T","MJout/MJin","MJout","%","MJ/MJdoorzet","g/MJ","g/MJ","g/MJ","g/MJ"]
[null,"EU",{"$f":"E19&\"-\"&F19","v":"1a-Woodchips from forest residues"},{"$f":"D8","v":"EU-NL"},"1a","Woodchips from forest residues",0,{"$f":"W19+AH19+AS19","v":1.8407965330386269},{"$f":"BD19","v":3},0.41358188387,2,null,"Forest residues collection","Dit is inclusief forwarden, bundelen, oliegebruik, transport van machines van en naar de werkplek, laden en lossen. Het bevat scenario's los top- en takhout, bundelen en oogst van stobben. Voor het olieverbruik wordt uitgegaan van 6 % van het dieselverbruik van de machines. De emissiefactor van olie is gelijkgesteld aan diesel. \nDe vochtigheid (M) is aangenomen op 50 %.","P",1,{"$f":"AB19*P19","v":1.0789473684210524},50,1.442660098522164E-2,{"$f":"S19*JRC_Basis_Diesel_CO2*Q19","v":1.462339543038627},0,0,{"$f":"T19*JRC_GWP_CO2+U19*JRC_GWP_CH4+V19*JRC_GWP_N2O","v":1.462339543038627},"Forest residues seasoning","It includes open air seasoning at roadside with the residues covered from rain. Storage is usually for a period of 3-8 months\n\n","P",{"$f":"100/95","v":1.0526315789473684},{"$f":"AM19*AA19","v":1.0789473684210524},30,0,0,0,0,{"$f":"AE19*JRC_GWP_CO2+AF19*JRC_GWP_CH4+AG19*JRC_GWP_N2O","v":0},"Wood chipping","Required for chips, pellets and for briquette production\n","P",1.0249999999999999,{"$f":"AX19*AL19","v":1.0249999999999999},30,4.0283999999999997E-3,{"$f":"AO19*JRC_Basis_Diesel_CO2","v":0.37845698999999994},0,0,{"$f":"AP19*JRC_GWP_CO2+AQ19*JRC_GWP_CH4+AR19*JRC_GWP_N2O","v":0.37845698999999994},"Transport of wood chips to end-user","Transport of seasoned wood chips from forest roadside to the plant gate. Moisture is considered to be 30%\n","T",1,{"$f":"BI19*AW19","v":1},30,{"$f":"BA19/JRC_Basis_Diesel_CO2","v":3.1664665124349331E-2},2.974807331029496,0,0,3,null,null,null,1,{"$f":"BT19*BH19","v":1},50,null,null,null,null,0,null,null,null,1,{"$f":"CE19*BS19","v":1},null,null,null,null,null,0,null,null,null,1,1,null,null,null,null,null,null,null,null,null,null,{"$f":"C19","v":"1a-Woodchips from forest residues"},{"$f":"N19","v":"Dit is inclusief forwarden, bundelen, oliegebruik, transport van machines van en naar de werkplek, laden en lossen. Het bevat scenario's los top- en takhout, bundelen en oogst van stobben. Voor het olieverbruik wordt uitgegaan van 6 % van het dieselverbruik van de machines. De emissiefactor van olie is gelijkgesteld aan diesel. \nDe vochtigheid (M) is aangenomen op 50 %."},{"$f":"Y19","v":"It includes open air seasoning at roadside with the residues covered from rain. Storage is usually for a period of 3-8 months\n\n"},{"$f":"AJ19","v":"Required for chips, pellets and for briquette production\n"},{"$f":"AU19","v":"Transport of seasoned wood chips from forest roadside to the plant gate. Moisture is considered to be 30%\n"}]
[null,null,"2a-Woodchips from stemwood","EU-NL","2a","Woodchips from stemwood",1.0938001578947383,0.3272319675,3,0.41358188387,1,null,"Teelt rondhout",null,"C",1,null,null,null,null,null,null,1.0947368421052632,"Transport naar centrale opslag",null,"T",1,null,null,null,null,null,null,null,"Drogen langs de weg",null,"P",null,null,null,null,null,null,null,0,"Chippen",null,"P",null,null,null,null,null,null,null,0.32631578947368423,"Transport chips naar afnemer",null,"T",null,null,null,null,null,null,null,3,null,null,null,null,null,null,null,null,null,null,0,null,null,null,null,null,null,null,null,null,null,null,null,null,null,null,"2a-Woodchips from stemwood",0,0,0,{"$f":"AU20","v":0}]
[null,null,"2b-Wood briquettes or pellets from Stemwood (case 1)","EU-NL","2b","Wood briquettes or pellets from Stemwood (case 1)",1.0631666666666666,24.797444444444441,2.8813333333333402,0.251214539475,0,null,"Teelt rondhout",null,"C",1,null,null,null,null,null,null,1.0473684210526315,"Transport naar centrale opslag",null,"T",null,null,null,null,null,null,null,null,"Chippen",null,"P",null,null,null,null,null,null,null,0.33157894736842103,"Transport naar pelletfabriek",null,"T",null,null,null,null,null,null,null,0,"Drogen, verkleinen en pelletiseren",null,"P",null,null,null,null,null,null,null,24.142105263157895,"Transport Pellets naar afnemer",null,"T",null,null,null,null,null,null,null,2.8789473684210529,null,null,null,null,null,null,null,null,null,null,null,null,null,null,null,"2b-Wood briquettes or pellets from Stemwood (case 1)",0,0,0,0]
[null,null,"2c-Pathway not in EU","NL","2c","Pathway not in EU","n.a.","n.a.","n.a.","n.a.","n.a.",null,"Pathway not in Biograce-II",null,null,null,null,null,null,null,null,null,0,null,null,null,null,null,null,null,null,null,null,null,null,null,null,null,null,null,null,null,null,null,0,null,null,null,null,null,null,null,null,null,null,0,null,null,null,null,null,null,null,null,null,null,0,null,null,null,null,null,null,null,null,null,null,0,null,null,null,null,null,null,null,null,null,null,null,null,null,null,null,"2c-Pathway not in EU",0,0,0,0]
[null,null,"3a-Woodchips from industry residues","EU-NL","3a","Woodchips from industry residues",0,0.32250000000000001,3.032,0.41358188387,3,null,"Chippen  ",null,"P",null,null,null,null,null,null,null,0.32631578947368423,"Transport chips naar de afnemer",null,"T",null,null,null,null,null,null,null,null,null,null,null,null,null,null,null,null,null,null,0,null,null,null,null,null,null,null,null,null,null,0,null,null,null,null,null,null,null,null,null,null,0,null,null,null,null,null,null,null,null,null,null,0,null,null,null,null,null,null,null,null,null,null,null,null,null,null,null,"3a-Woodchips from industry residues",0,0,0,0]
[null,null,"3b-Wood briquettes or pellets from woodindustry residues (dry M10)","EU-NL","3b","Wood briquettes or pellets from woodindustry residues (dry M10)",0,0.22211111111111115,2.8305833333333332,0.251214539475,5,null,"Transport materiaal naar Pelletfabriek",null,"T",1,null,null,null,null,null,null,0,"Droge, verklinen en pelletiseren",null,"P",null,null,null,null,null,null,null,null,"Transport pellets naar afnemer",null,"T",null,null,null,null,null,null,null,2.8789473684210529,null,null,null,null,null,null,null,null,null,null,0,null,null,null,null,null,null,null,null,null,null,0,null,null,null,null,null,null,null,null,null,null,0,null,null,null,null,null,null,null,null,null,null,null,null,null,null,null,"3b-Wood briquettes or pellets from woodindustry residues (dry M10)",0,0,0,0]
[null,null,"4a-Pathway not in EU","NL","4a","Pathway not in EU","n.a.","n.a.","n.a.","n.a.","n.a.",null,"Pathway not in Biograce-II",null,null,null,null,null,null,null,null,null,0,null,null,null,null,null,null,null,null,null,null,null,null,null,null,null,null,null,null,null,null,null,0,null,null,null,null,null,null,null,null,null,null,0,null,null,null,null,null,null,null,null,null,null,0,null,null,null,null,null,null,null,null,null,null,0,null,null,null,null,null,null,null,null,null,null,null,null,null,null,null,"4a-Pathway not in EU",0,0,0,0]
[null,null,"4b-Pathway not in EU","NL","4b","Pathway not in EU","n.a.","n.a.","n.a.","n.a.","n.a.",null,"Pathway not in Biograce-II",null,null,null,null,null,null,null,null,null,0,null,null,null,null,null,null,null,null,null,null,null,null,null,null,null,null,null,null,null,null,null,0,null,null,null,null,null,null,null,null,null,null,0,null,null,null,null,null,null,null,null,null,null,0,null,null,null,null,null,null,null,null,null,null,0,null,null,null,null,null,null,null,null,null,null,null,null,null,null,null,"4b-Pathway not in EU",0,0,0,0]
[null,null,{"$f":"C4","v":1},{"$f":"D4","v":2},3,4,5,6,7,8,9,10,11,12,13,14,15,16,17,18,19,20,21,22,null,null,null,null,null,null,null,null,null,null,null,null,null,null,null,null,null,null,null,null,null,null,null,null,null,null,null,null,null,null,null,null,null,null,null,null,null,null,null,null,null,null,null,null,null,null,null,null,null,null,null,null,null,null,null,null,null,null,null,null,null,null,null,null,null,null,null,null,null,1]
[]
[null,null,"Keten_Nr_Titel",1]
[null,null,"Keten_Titel_NL_EU",2]
[null,null,"Keten_Nr",3]
[null,null,"Keten_Titel",4]
[null,null,"Keten_Cultivatie_CO2",5]
[null,null,"Keten_Proces_CO2",6]
[null,null,"Keten_Transport_CO2",7]
[null,null,"Keten_Verbranding_CO2",8]
[null,null,"Keten_Totaal_CO2",9]
[null,null,"Keten_Stappen",10]
[null,null,"Keten_Stap1",11]
[null,null,"Keten_Stap1_Detail",12]
[null,null,"Keten_Stap1_CPT",13]
[null,null,"Keten_Stap1_Doorzet",14]
[null,null,"Keten_Stap1_Doorzet_Abs",15]
[null,null,"Keten_Stap1_Vochtigheid",16]
[null,null,"Keten_Stap1_Verbruik_Diesel",17]
[null,null,"Keten_Stap1_CO2",18]
[null,null,"Keten_Stap1_CH4",19]
[null,null,"Keten_Stap1_N2O",20]
[null,null,"Keten_Stap1_CO2eq",21]
[null,null,"Keten_Delta",11]

{"sheet":"Lijsten","index":13,"n_rows":74,"n_cols":28,"rows_kept":74,"cut":false,"hidden":true,"merged":[]}
[]
[]
[]
[null,"Lijst_Hout_CO2eq_Samenvatting_Dim",null,null,null,null,null,null,null,null,null,null,"Lijst_Proces_CO2eq_Samenvatting_Dim",null,null,null,null,null,null,null,null,null,null,"Lijst_Transport_CO2eq_Samenvatting_Dim"]
[null,"1.2",null,null,1,"gCO2eq",null,null,null,null,null,null,null,null,null,1,"gCO2eq",null,null,null,null,null,null,null,null,null,1,"gCO2eq"]
[null,null,null,null,2,"kgCO2eq",null,null,null,null,null,null,null,null,null,2,"kgCO2eq",null,null,null,null,null,null,null,null,null,2,"kgCO2eq"]
[null,null,null,null,3,"tonCO2eq",null,null,null,null,null,null,null,null,null,3,"tonCO2eq",null,null,null,null,null,null,null,null,null,3,"tonCO2eq"]
[null,null,null,null,4,"MtonCO2eq",null,null,null,null,null,null,null,null,null,4,"MtonCO2eq",null,null,null,null,null,null,null,null,null,4,"MtonCO2eq"]
[]
[null,"Lijst_Hout_Doorzet_Samenvatting_Dim",null,null,null,null,null,null,null,null,null,null,"Lijst_Proces_Doorzet_Samenvatting_Dim",null,null,null,null,null,null,null,null,null,null,"Lijst_Transport_Doorzet_Samenvatting_Dim"]
[null,null,null,null,1,"m3",null,null,null,null,null,null,null,null,null,1,"kg",null,null,null,null,null,null,null,null,null,1,"ton"]
[null,null,null,null,2,"kg",null,null,null,null,null,null,null,null,null,2,"kgds",null,null,null,null,null,null,null,null,null,2,"tonds"]
[null,null,null,null,3,"kgds",null,null,null,null,null,null,null,null,null,3,"ton",null,null,null,null,null,null,null,null,null,3,"tonkm"]
[null,null,null,null,4,"ton",null,null,null,null,null,null,null,null,null,4,"tonds",null,null,null,null,null,null,null,null,null,4,"km"]
[null,null,null,null,5,"tonds",null,null,null,null,null,null,null,null,null,5,"m3",null,null,null,null,null,null,null,null,null,5,"m3"]
[null,null,null,null,6,"MJ",null,null,null,null,null,null,null,null,null,6,"MJ",null,null,null,null,null,null,null,null,null,6,"MJ"]
[null,null,null,null,7,"GJ",null,null,null,null,null,null,null,null,null,7,"GJ",null,null,null,null,null,null,null,null,null,7,"GJ"]
[null,null,null,null,8,"MWh",null,null,null,null,null,null,null,null,null,8,"kWh",null,null,null,null,null,null,null,null,null,8,"kWh"]
[null,null,null,null,9,"kWh",null,null,null,null,null,null,null,null,null,9,"MWh",null,null,null,null,null,null,null,null,null,9,"MWh"]
[]
[null,"Lijst_Hout_Hoeveelheid_Dim",null,null,null,null,null,null,null,null,null,null,"Lijst_Proces_Capaciteit_Dim",null,null,null,null,null,null,null,null,null,null,"Lijst_Transport_Laadvermogen_Dim"]
[null,null,null,null,1,"m3",null,null,null,null,null,null,null,null,null,1,"uur",null,null,null,null,null,null,null,null,null,1,"m3"]
[null,null,null,null,2,"kg",null,null,null,null,null,null,null,null,null,2,"m3/uur",null,null,null,null,null,null,null,null,null,2,"ton"]
[null,null,null,null,3,"kgds",null,null,null,null,null,null,null,null,null,3,"ton/uur"]
[null,null,null,null,4,"ton",null,null,null,null,null,null,null,null,null,4,"tonds/uur"]
[null,null,null,null,5,"tonds",null,null,null,null,null,null,null,null,null,5,"GJ/uur"]
[null,null,null,null,6,"MJ",null,null,null,null,null,null,null,null,null,6,"MWh/uur"]
[null,null,null,null,7,"GJ",null,null,null,null,null,null,null,null,null,7,"uur/m3"]
[null,null,null,null,8,"MWh",null,null,null,null,null,null,null,null,null,8,"uur/ton"]
[null,null,null,null,9,"kWh",null,null,null,null,null,null,null,null,null,9,"uur/tonds"]
[null,null,null,null,null,null,null,null,null,null,null,null,null,null,null,10,"uur/GJ"]
[null,"Lijst_Hout_Teelt_Eindgebruiker",null,null,null,null,null,null,null,null,null,null,null,null,null,11,"uur/MWh"]
[null,null,null,null,null,"naar eindgebruiker"]
[null,null,null,null,null,"uit oogst",null,null,null,null,null,null,"Lijst_Proces_Brandstof_Euronorm",null,null,null,null,null,null,null,null,null,null,"Lijst_Transport_Brandstof_Euronorm"]
[null,null,null,null,null,null,null,null,null,null,null,null,null,null,null,null,"Euro 1",null,null,null,null,null,null,null,null,null,null,"Euro 1"]
[null,null,null,null,null,null,null,null,null,null,null,null,null,null,null,null,"Euro 2",null,null,null,null,null,null,null,null,null,null,"Euro 2"]
[null,null,null,null,null,null,null,null,null,null,null,null,null,null,null,null,"Euro 3",null,null,null,null,null,null,null,null,null,null,"Euro 3"]
[null,null,null,null,null,null,null,null,null,null,null,null,null,null,null,null,"Euro 4",null,null,null,null,null,null,null,null,null,null,"Euro 4"]
[null,null,null,null,null,null,null,null,null,null,null,null,null,null,null,null,"Euro 5",null,null,null,null,null,null,null,null,null,null,"Euro 5"]
[null,null,null,null,null,null,null,null,null,null,null,null,null,null,null,null,"Euro 6",null,null,null,null,null,null,null,null,null,null,"Euro 6"]
[]
[]
[null,null,null,null,null,null,null,null,null,null,null,null,"Lijst_Proces_Brandstof_Verbruik_Dim",null,null,null,null,null,null,null,null,null,null,"Lijst_Transport_Brandstof_Verbruik_Dim"]
[null,null,null,null,null,null,null,null,null,null,null,null,null,null,null,1,"liter",null,null,null,null,null,null,null,null,null,1,"liter"]
[null,null,null,null,null,null,null,null,null,null,null,null,null,null,null,2,"m3",null,null,null,null,null,null,null,null,null,2,"liter/km"]
[null,null,null,null,null,null,null,null,null,null,null,null,null,null,null,3,"kg",null,null,null,null,null,null,null,null,null,3,"liter/100km"]
[null,null,null,null,null,null,null,null,null,null,null,null,null,null,null,4,"ton",null,null,null,null,null,null,null,null,null,4,"kg"]
[null,null,null,null,null,null,null,null,null,null,null,null,null,null,null,5,"liter/uur",null,null,null,null,null,null,null,null,null,5,"kg/km"]
[null,null,null,null,null,null,null,null,null,null,null,null,null,null,null,6,"m3/uur",null,null,null,null,null,null,null,null,null,6,"kg/100km"]
[null,null,null,null,null,null,null,null,null,null,null,null,null,null,null,7,"kg/uur"]
[null,null,null,null,null,null,null,null,null,null,null,null,null,null,null,8,"ton/uur"]
[]
[null,null,null,null,null,null,null,null,null,null,null,null,"Lijst_Proces_Elektriciteit_Vermogen_Dim",null,null,null,null,null,null,null,null,null,null,"Lijst_Transport_Elektriciteit_Vermogen_Dim"]
[null,null,null,null,null,null,null,null,null,null,null,null,null,null,null,1,"kW",null,null,null,null,null,null,null,null,null,1,"kW"]
[null,null,null,null,null,null,null,null,null,null,null,null,null,null,null,2,"MW",null,null,null,null,null,null,null,null,null,2,"MW"]
[]
[]
[]
[null,null,null,null,null,null,null,null,null,null,null,null,"Lijst_Proces_Elektriciteit_Verbruik_Dim",null,null,null,null,null,null,null,null,null,null,"Lijst_Transport_Elektriciteit_Verbruik_Dim"]
[null,null,null,null,null,null,null,null,null,null,null,null,null,null,null,null,"kWh",null,null,null,1,null,null,null,null,null,1,"kWh"]
[null,null,null,null,null,null,null,null,null,null,null,null,null,null,null,null,"MWh",null,null,null,2,null,null,null,null,null,2,"MWh"]
[null,null,null,null,null,null,null,null,null,null,null,null,null,null,null,null,"MJ",null,null,null,3,null,null,null,null,null,3,"MJ"]
[null,null,null,null,null,null,null,null,null,null,null,null,null,null,null,null,"GJ",null,null,null,4,null,null,null,null,null,4,"GJ"]
[]
[null,"Lijst_Hout_CO2eq_Dim",null,null,null,null,null,null,null,null,null,null,"Lijst_Proces_CO2eq_Dim",null,null,null,null,null,null,null,null,null,null,"Lijst_Transport_CO2eq_Dim"]
[null,null,null,null,1,"gCO2eq/MJ",null,null,null,null,null,null,null,null,null,1,"gCO2eq/MJ",null,null,null,null,null,null,null,null,null,1,"gCO2eq/MJ"]
[null,null,null,null,2,"kgCO2eq",null,null,null,null,null,null,null,null,null,2,"kgCO2eq/tonds",null,null,null,null,null,null,null,null,null,2,"gCO2eq/tkm"]
[null,null,null,null,3,"kgCO2eq/tonds",null,null,null,null,null,null,null,null,null,3,"kgCO2eq",null,null,null,null,null,null,null,null,null,3,"kgCO2eq"]
[null,null,null,null,4,"tonCO2eq",null,null,null,null,null,null,null,null,null,4,"tonCO2eq",null,null,null,null,null,null,null,null,null,4,"kgCO2eq/tonds"]
[null,null,null,null,5,"MtonCO2eq",null,null,null,null,null,null,null,null,null,5,"MtonCO2eq",null,null,null,null,null,null,null,null,null,5,"tonCO2eq"]
[null,null,null,null,null,null,null,null,null,null,null,null,null,null,null,null,null,null,null,null,null,null,null,null,null,null,6,"MtonCO2eq"]
[null,null,null,null,null,null,null,null,null,null,null,null,"Lijst_Invoer_Uitvoer"]
[null,null,null,null,null,null,null,null,null,null,null,null,null,null,null,1,"Invoer"]
[null,null,null,null,null,null,null,null,null,null,null,null,null,null,null,2,"Uitvoer"]